BDBM26729 N-[4-(6-chloro-1,3-benzothiazol-2-yl)phenyl]-1-(thiophene-2-sulfonyl)piperidine-4-carboxamide::benzothiazole analogue, 16g
SMILES: Clc1ccc2nc(sc2c1)-c1ccc(NC(=O)C2CCN(CC2)S(=O)(=O)c2cccs2)cc1
InChI Key: InChIKey=ZYYFZOHIGWACKH-UHFFFAOYSA-N
Data: 1 IC50
Activity Spreadsheet -- Enzyme Inhibition Constant Data from BindingDB
Found 1 hit for monomerid = 26729
Trg + Lig
Ki
nM
ΔG°
kcal/mole
IC50
nM
Kd
nM
EC50/IC50
nM
koff
s-1
kon
M-1s-1
pHTemp
°C
Fatty-acid amide hydrolase 1 (aa 30-579)
(Rattus norvegicus (rat))
BDBM26729
(N-[4-(6-chloro-1,3-benzothiazol-2-yl)phenyl]-1-(th...)
Show SMILES Clc1ccc2nc(sc2c1)-c1ccc(NC(=O)C2CCN(CC2)S(=O)(=O)c2cccs2)cc1
Show InChI InChI=1S/C23H20ClN3O3S3/c24-17-5-8-19-20(14-17)32-23(26-19)16-3-6-18(7-4-16)25-22(28)15-9-11-27(12-10-15)33(29,30)21-2-1-13-31-21/h1-8,13-15H,9-12H2,(H,25,28)
n/an/a 14n/an/an/an/a8.022
Abbott Laboratories
Assay Description
[3H]anandamide was incubated with membranes to produce radiolabeled ethanolamine and unlabeled arachidonic acid. Charcoal selectively binds anandamid...
J Med Chem 52: 170-80 (2009)
Article DOI: 10.1021/jm801042a
BindingDB Entry DOI: 10.7270/Q24B2ZMQ