BDBM26731 N-[4-(4-methyl-1,3-benzothiazol-2-yl)phenyl]-1-(thiophene-2-sulfonyl)piperidine-4-carboxamide::benzothiazole analogue, 16i
SMILES: Cc1cccc2sc(nc12)-c1ccc(NC(=O)C2CCN(CC2)S(=O)(=O)c2cccs2)cc1
InChI Key: InChIKey=YFSJSEQQUOXJSS-UHFFFAOYSA-N
Data: 1 IC50
Activity Spreadsheet -- Enzyme Inhibition Constant Data from BindingDB
Found 1 hit for monomerid = 26731
Trg + Lig
Ki
nM
ΔG°
kcal/mole
IC50
nM
Kd
nM
EC50/IC50
nM
koff
s-1
kon
M-1s-1
pHTemp
°C
Fatty-acid amide hydrolase 1 (aa 30-579)
(Rattus norvegicus (rat))
BDBM26731
(N-[4-(4-methyl-1,3-benzothiazol-2-yl)phenyl]-1-(th...)
Show SMILES Cc1cccc2sc(nc12)-c1ccc(NC(=O)C2CCN(CC2)S(=O)(=O)c2cccs2)cc1
Show InChI InChI=1S/C24H23N3O3S3/c1-16-4-2-5-20-22(16)26-24(32-20)18-7-9-19(10-8-18)25-23(28)17-11-13-27(14-12-17)33(29,30)21-6-3-15-31-21/h2-10,15,17H,11-14H2,1H3,(H,25,28)
n/an/a 14n/an/an/an/a8.022
Abbott Laboratories
Assay Description
[3H]anandamide was incubated with membranes to produce radiolabeled ethanolamine and unlabeled arachidonic acid. Charcoal selectively binds anandamid...
J Med Chem 52: 170-80 (2009)
Article DOI: 10.1021/jm801042a
BindingDB Entry DOI: 10.7270/Q24B2ZMQ