BDBM268718 US9718825, Example 120
SMILES: Cc1ccc(C#N)c(c1)S(=O)(=O)Nc1ccc(cc1)-c1nc(OC2C[C@@H](O)C[C@@H](O)C2)c2cn[nH]c2n1
InChI Key:
Data: 1 IC50
Activity Spreadsheet -- Enzyme Inhibition Constant Data from BindingDB
Found 1 hit for monomerid = 268718
Trg + Lig
Ki
nM
ΔG°
kcal/mole
IC50
nM
Kd
nM
EC50/IC50
nM
koff
s-1
kon
M-1s-1
pHTemp
°C
Serine/threonine-protein kinase Sgk1
(Homo sapiens (Human))
BDBM268718
(US9718825, Example 120)
Show SMILES Cc1ccc(C#N)c(c1)S(=O)(=O)Nc1ccc(cc1)-c1nc(OC2C[C@@H](O)C[C@@H](O)C2)c2cn[nH]c2n1 |r|
Reactome pathway
US Patent
n/an/a<1.5n/an/an/an/a7.4n/a
SANOFI
US Patent
Assay Description
The compounds were tested for serum and glucocorticoid-regulated kinase 1 (SGK-1) inhibitory activity in a substrate phosphorylation assay designed t...
US Patent US9718825 (2017)
BindingDB Entry DOI: 10.7270/Q2VM4F82