null
SMILES: Cc1ccc(C#N)c(c1)S(=O)(=O)Nc1ccc(cc1)-c1nc(OCC2CNC2)c2cn[nH]c2n1
InChI Key: InChIKey=ARRZQDPWRVOZLL-UHFFFAOYSA-N
Activity Spreadsheet -- Enzyme Inhibition Constant Data from BindingDB
Found 1 hit for monomerid = 268755
Trg + Lig
Ki
nM
ΔG°
kcal/mole
IC50
nM
Kd
nM
EC50/IC50
nM
koff
s-1
kon
M-1s-1
pHTemp
°C
Serine/threonine-protein kinase Sgk1
(Homo sapiens (Human))
BDBM268755
(US9718825, Example 157)
Show SMILES Cc1ccc(C#N)c(c1)S(=O)(=O)Nc1ccc(cc1)-c1nc(OCC2CNC2)c2cn[nH]c2n1
Show InChI InChI=1S/C23H21N7O3S/c1-14-2-3-17(9-24)20(8-14)34(31,32)30-18-6-4-16(5-7-18)21-27-22-19(12-26-29-22)23(28-21)33-13-15-10-25-11-15/h2-8,12,15,25,30H,10-11,13H2,1H3,(H,26,27,28,29)
Reactome pathway
US Patent
n/an/a<1.5n/an/an/an/a7.4n/a
SANOFI
US Patent
Assay Description
The compounds were tested for serum and glucocorticoid-regulated kinase 1 (SGK-1) inhibitory activity in a substrate phosphorylation assay designed t...
US Patent US9718825 (2017)
BindingDB Entry DOI: 10.7270/Q2VM4F82