BDBM27363 7,7-dimethyl-2-(pyridin-4-yl)-1H,4H,5H,6H,7H-pyrrolo[3,2-c]pyridin-4-one::Pyrrolopyridinone, 82
SMILES: CC1(C)CNC(=O)c2cc([nH]c12)-c1ccncc1
InChI Key: InChIKey=ZFOONOHKCOMKKX-UHFFFAOYSA-N
Data: 1 IC50
Activity Spreadsheet -- Enzyme Inhibition Constant Data from BindingDB
Found 1 hit for monomerid = 27363
Trg + Lig
Ki
nM
ΔG°
kcal/mole
IC50
nM
Kd
nM
EC50/IC50
nM
koff
s-1
kon
M-1s-1
pHTemp
°C
Cdc7 Kinase
(Homo sapiens (Human))
BDBM27363
(7,7-dimethyl-2-(pyridin-4-yl)-1H,4H,5H,6H,7H-pyrro...)
Show SMILES CC1(C)CNC(=O)c2cc([nH]c12)-c1ccncc1
Show InChI InChI=1S/C14H15N3O/c1-14(2)8-16-13(18)10-7-11(17-12(10)14)9-3-5-15-6-4-9/h3-7,17H,8H2,1-2H3,(H,16,18)
Reactome pathway
n/an/a 3n/an/an/an/a7.925
Nerviano Medical Sciences Srl
Assay Description
The potency of the compound toward kinase activity was determined using a Dowex resin-based assay. The substrate was phosphorylated by kinase in the ...
J Med Chem 52: 293-307 (2009)
Article DOI: 10.1021/jm800977q
BindingDB Entry DOI: 10.7270/Q27W69JX