BDBM27678 3,5-difluoro-2-{[4-fluoro-3-(piperazin-1-ylcarbonyl)phenyl]methoxy}benzamide::substituted 2-benzyloxyfluorobenzamide, 20
SMILES: NC(=O)c1cc(F)cc(F)c1OCc1ccc(F)c(c1)C(=O)N1CCNCC1
InChI Key: InChIKey=FLKPINQSXBRFRF-UHFFFAOYSA-N
Data: 1 IC50
Activity Spreadsheet -- Enzyme Inhibition Constant Data from BindingDB
Found 1 hit for monomerid = 27678
Trg + Lig
Ki
nM
ΔG°
kcal/mole
IC50
nM
Kd
nM
EC50/IC50
nM
koff
s-1
kon
M-1s-1
pHTemp
°C
Poly [ADP-ribose] polymerase 1
(Homo sapiens (Human))
BDBM27678
(3,5-difluoro-2-{[4-fluoro-3-(piperazin-1-ylcarbony...)
Show SMILES NC(=O)c1cc(F)cc(F)c1OCc1ccc(F)c(c1)C(=O)N1CCNCC1
Show InChI InChI=1S/C19H18F3N3O3/c20-12-8-14(18(23)26)17(16(22)9-12)28-10-11-1-2-15(21)13(7-11)19(27)25-5-3-24-4-6-25/h1-2,7-9,24H,3-6,10H2,(H2,23,26)
n/an/a 1.50E+3n/an/an/an/a7.422
KuDOS Pharmaceuticals Ltd
Assay Description
A FlashPlate scintillation proximity assay has been developed to identify inhibitors of PARP-1. The mechanism of action of the assay requires the bin...
Bioorg Med Chem Lett 18: 3942-5 (2008)
Article DOI: 10.1016/j.bmcl.2008.06.025
BindingDB Entry DOI: 10.7270/Q2FF3QPX