null
SMILES: Cc1cc(CC2CC2)cc(C)c1NC(=O)Nc1cc(F)ccc1C(=O)N[C@@H](C1CCCCC1)C(O)=O
InChI Key: InChIKey=XUJLFPBPUYFSHU-VWLOTQADSA-N
Activity Spreadsheet -- Enzyme Inhibition Constant Data from BindingDB
Found 1 hit for monomerid = 27740
Trg + Lig
Ki
nM
ΔG°
kcal/mole
IC50
nM
Kd
nM
EC50/IC50
nM
koff
s-1
kon
M-1s-1
pHTemp
°C
Glycogen phosphorylase, liver form
(Homo sapiens (Human))
BDBM27740
((2S)-2-cyclohexyl-2-{[2-({[4-(cyclopropylmethyl)-2...)
Show SMILES Cc1cc(CC2CC2)cc(C)c1NC(=O)Nc1cc(F)ccc1C(=O)N[C@@H](C1CCCCC1)C(O)=O |r|
Show InChI InChI=1S/C28H34FN3O4/c1-16-12-19(14-18-8-9-18)13-17(2)24(16)32-28(36)30-23-15-21(29)10-11-22(23)26(33)31-25(27(34)35)20-6-4-3-5-7-20/h10-13,15,18,20,25H,3-9,14H2,1-2H3,(H,31,33)(H,34,35)(H2,30,32,36)/t25-/m0/s1
Reactome pathway
n/an/a 13n/an/an/an/a7.625
GSK
Assay Description
An enzymatic assay was developed to measure the response of the activated form of glycogen phosphorylase to small molecule compounds. The assay was t...
Bioorg Med Chem Lett 19: 1177-82 (2009)
Article DOI: 10.1016/j.bmcl.2008.12.085
BindingDB Entry DOI: 10.7270/Q22805ZM