null
SMILES: CCCN1CCC(CC1)Oc1ccc(OC)c(Nc2nc(Nc3cccc(F)c3C(N)=O)c3cc[nH]c3n2)c1
InChI Key: InChIKey=HZGCLKXERMMKEB-UHFFFAOYSA-N
Activity Spreadsheet -- Enzyme Inhibition Constant Data from BindingDB
Found 2 hits for monomerid = 27790
Trg + Lig
Ki
nM
ΔG°
kcal/mole
IC50
nM
Kd
nM
EC50/IC50
nM
koff
s-1
kon
M-1s-1
pHTemp
°C
Mitogen-activated protein kinase 8
(Homo sapiens (Human))
BDBM27790
(2-fluoro-6-{[2-({2-methoxy-5-[(1-propylpiperidin-4...)
Show SMILES CCCN1CCC(CC1)Oc1ccc(OC)c(Nc2nc(Nc3cccc(F)c3C(N)=O)c3cc[nH]c3n2)c1
Show InChI InChI=1S/C28H32FN7O3/c1-3-13-36-14-10-17(11-15-36)39-18-7-8-23(38-2)22(16-18)33-28-34-26-19(9-12-31-26)27(35-28)32-21-6-4-5-20(29)24(21)25(30)37/h4-9,12,16-17H,3,10-11,13-15H2,1-2H3,(H2,30,37)(H3,31,32,33,34,35)
NCI pathway
Reactome pathway
n/an/a 1.26E+3n/an/an/an/an/an/a
GSK
Assay Description
Assays are performed in 384-well microtiter plates in reaction buffer containing substrate GST-biotin-C-JUN, ATP, and purified activated JNK1alpha1 i...
Bioorg Med Chem Lett 19: 360-4 (2009)
Article DOI: 10.1016/j.bmcl.2008.11.077
BindingDB Entry DOI: 10.7270/Q2NZ85ZT
Insulin-like growth factor 1 receptor
(Homo sapiens (Human))
BDBM27790
(2-fluoro-6-{[2-({2-methoxy-5-[(1-propylpiperidin-4...)
Show SMILES CCCN1CCC(CC1)Oc1ccc(OC)c(Nc2nc(Nc3cccc(F)c3C(N)=O)c3cc[nH]c3n2)c1
Show InChI InChI=1S/C28H32FN7O3/c1-3-13-36-14-10-17(11-15-36)39-18-7-8-23(38-2)22(16-18)33-28-34-26-19(9-12-31-26)27(35-28)32-21-6-4-5-20(29)24(21)25(30)37/h4-9,12,16-17H,3,10-11,13-15H2,1-2H3,(H2,30,37)(H3,31,32,33,34,35)
Reactome pathway
n/an/a 6n/an/an/an/a7.522
GSK
Assay Description
Assays are performed in 384-well microtiter plates in reaction buffer containing biotinylated substrate, ATP, and purified activated GST-IGF-1R in th...
Bioorg Med Chem Lett 19: 360-4 (2009)
Article DOI: 10.1016/j.bmcl.2008.11.077
BindingDB Entry DOI: 10.7270/Q2NZ85ZT