BDBM27796 2-({2-[(1-acetyl-5-methoxy-2,3-dihydro-1H-indol-6-yl)amino]-7H-pyrrolo[2,3-d]pyrimidin-4-yl}amino)-6-fluorobenzamide::pyrrolo[2,3-d]pyrimidine deriv., 20
SMILES: COc1cc2CCN(C(C)=O)c2cc1Nc1nc(Nc2cccc(F)c2C(N)=O)c2cc[nH]c2n1
InChI Key: InChIKey=GURLMHMMTNQPMF-UHFFFAOYSA-N
Data: 2 IC50
Activity Spreadsheet -- Enzyme Inhibition Constant Data from BindingDB
Found 2 hits for monomerid = 27796
Trg + Lig
Ki
nM
ΔG°
kcal/mole
IC50
nM
Kd
nM
EC50/IC50
nM
koff
s-1
kon
M-1s-1
pHTemp
°C
Mitogen-activated protein kinase 8
(Homo sapiens (Human))
BDBM27796
(2-({2-[(1-acetyl-5-methoxy-2,3-dihydro-1H-indol-6-...)
Show SMILES COc1cc2CCN(C(C)=O)c2cc1Nc1nc(Nc2cccc(F)c2C(N)=O)c2cc[nH]c2n1
Show InChI InChI=1S/C24H22FN7O3/c1-12(33)32-9-7-13-10-19(35-2)17(11-18(13)32)29-24-30-22-14(6-8-27-22)23(31-24)28-16-5-3-4-15(25)20(16)21(26)34/h3-6,8,10-11H,7,9H2,1-2H3,(H2,26,34)(H3,27,28,29,30,31)
NCI pathway
Reactome pathway
n/an/a 126n/an/an/an/an/an/a
GSK
Assay Description
Assays are performed in 384-well microtiter plates in reaction buffer containing substrate GST-biotin-C-JUN, ATP, and purified activated JNK1alpha1 i...
Bioorg Med Chem Lett 19: 360-4 (2009)
Article DOI: 10.1016/j.bmcl.2008.11.077
BindingDB Entry DOI: 10.7270/Q2NZ85ZT
Insulin-like growth factor I receptor
(Homo sapiens (Human))
BDBM27796
(2-({2-[(1-acetyl-5-methoxy-2,3-dihydro-1H-indol-6-...)
Show SMILES COc1cc2CCN(C(C)=O)c2cc1Nc1nc(Nc2cccc(F)c2C(N)=O)c2cc[nH]c2n1
Show InChI InChI=1S/C24H22FN7O3/c1-12(33)32-9-7-13-10-19(35-2)17(11-18(13)32)29-24-30-22-14(6-8-27-22)23(31-24)28-16-5-3-4-15(25)20(16)21(26)34/h3-6,8,10-11H,7,9H2,1-2H3,(H2,26,34)(H3,27,28,29,30,31)
Reactome pathway
n/an/a 6n/an/an/an/a7.522
GSK
Assay Description
Assays are performed in 384-well microtiter plates in reaction buffer containing biotinylated substrate, ATP, and purified activated GST-IGF-1R in th...
Bioorg Med Chem Lett 19: 360-4 (2009)
Article DOI: 10.1016/j.bmcl.2008.11.077
BindingDB Entry DOI: 10.7270/Q2NZ85ZT