BDBM27831 2-fluoro-6-{[2-({2-methoxy-4-[4-(propan-2-yl)piperazin-1-yl]phenyl}amino)-7-methyl-7H-pyrrolo[2,3-d]pyrimidin-4-yl]amino}benzamide::4,6-bis-anilino-1H-pyrrolo[2,3-d]pyrimidine, 15
SMILES: COc1cc(ccc1Nc1nc(Nc2cccc(F)c2C(N)=O)c2ccn(C)c2n1)N1CCN(CC1)C(C)C
InChI Key: InChIKey=OUWROBCRBMNFHE-UHFFFAOYSA-N
Data: 1 IC50
Activity Spreadsheet -- Enzyme Inhibition Constant Data from BindingDB
Found 1 hit for monomerid = 27831
Trg + Lig
Ki
nM
ΔG°
kcal/mole
IC50
nM
Kd
nM
EC50/IC50
nM
koff
s-1
kon
M-1s-1
pHTemp
°C
Insulin-like growth factor I receptor
(Homo sapiens (Human))
BDBM27831
(2-fluoro-6-{[2-({2-methoxy-4-[4-(propan-2-yl)piper...)
Show SMILES COc1cc(ccc1Nc1nc(Nc2cccc(F)c2C(N)=O)c2ccn(C)c2n1)N1CCN(CC1)C(C)C
Show InChI InChI=1S/C28H33FN8O2/c1-17(2)36-12-14-37(15-13-36)18-8-9-21(23(16-18)39-4)32-28-33-26(19-10-11-35(3)27(19)34-28)31-22-7-5-6-20(29)24(22)25(30)38/h5-11,16-17H,12-15H2,1-4H3,(H2,30,38)(H2,31,32,33,34)
Reactome pathway
n/an/a 1.00E+4n/an/an/an/a7.522
GSK
Assay Description
Assays are performed in 384-well microtiter plates in reaction buffer containing biotinylated substrate, ATP, and purified activated GST-IGF-1R in th...
Bioorg Med Chem Lett 19: 469-73 (2009)
Article DOI: 10.1016/j.bmcl.2008.11.046
BindingDB Entry DOI: 10.7270/Q2J67F88