BDBM27833 2-fluoro-6-{[2-({5-fluoro-2-methoxy-4-[4-(propan-2-yl)piperazin-1-yl]phenyl}amino)-7H-pyrrolo[2,3-d]pyrimidin-4-yl]amino}benzamide::4,6-bis-anilino-1H-pyrrolo[2,3-d]pyrimidine, 17
SMILES: COc1cc(N2CCN(CC2)C(C)C)c(F)cc1Nc1nc(Nc2cccc(F)c2C(N)=O)c2cc[nH]c2n1
InChI Key: InChIKey=OLYYDZVMDBGTBZ-UHFFFAOYSA-N
Data: 1 IC50
Activity Spreadsheet -- Enzyme Inhibition Constant Data from BindingDB
Found 1 hit for monomerid = 27833
Trg + Lig
Ki
nM
ΔG°
kcal/mole
IC50
nM
Kd
nM
EC50/IC50
nM
koff
s-1
kon
M-1s-1
pHTemp
°C
Insulin-like growth factor I receptor
(Homo sapiens (Human))
BDBM27833
(2-fluoro-6-{[2-({5-fluoro-2-methoxy-4-[4-(propan-2...)
Show SMILES COc1cc(N2CCN(CC2)C(C)C)c(F)cc1Nc1nc(Nc2cccc(F)c2C(N)=O)c2cc[nH]c2n1
Show InChI InChI=1S/C27H30F2N8O2/c1-15(2)36-9-11-37(12-10-36)21-14-22(39-3)20(13-18(21)29)33-27-34-25-16(7-8-31-25)26(35-27)32-19-6-4-5-17(28)23(19)24(30)38/h4-8,13-15H,9-12H2,1-3H3,(H2,30,38)(H3,31,32,33,34,35)
Reactome pathway
n/an/a 2n/an/an/an/a7.522
GSK
Assay Description
Assays are performed in 384-well microtiter plates in reaction buffer containing biotinylated substrate, ATP, and purified activated GST-IGF-1R in th...
Bioorg Med Chem Lett 19: 469-73 (2009)
Article DOI: 10.1016/j.bmcl.2008.11.046
BindingDB Entry DOI: 10.7270/Q2J67F88