BDBM27840 2,3-difluoro-6-{[2-({2-methoxy-4-[4-(propan-2-yl)piperazin-1-yl]phenyl}amino)-7H-pyrrolo[2,3-d]pyrimidin-4-yl]amino}benzamide::4,6-bis-anilino-1H-pyrrolo[2,3-d]pyrimidine, 26::CHEMBL463932
SMILES: COc1cc(ccc1Nc1nc(Nc2ccc(F)c(F)c2C(N)=O)c2cc[nH]c2n1)N1CCN(CC1)C(C)C
InChI Key: InChIKey=QYJJQYYMVLXSDU-UHFFFAOYSA-N
Data: 2 IC50
Activity Spreadsheet -- Enzyme Inhibition Constant Data from BindingDB
Found 2 hits for monomerid = 27840
Trg + Lig
Ki
nM
ΔG°
kcal/mole
IC50
nM
Kd
nM
EC50/IC50
nM
koff
s-1
kon
M-1s-1
pHTemp
°C
Insulin-like growth factor I receptor
(Homo sapiens (Human))
BDBM27840
(2,3-difluoro-6-{[2-({2-methoxy-4-[4-(propan-2-yl)p...)
Show SMILES COc1cc(ccc1Nc1nc(Nc2ccc(F)c(F)c2C(N)=O)c2cc[nH]c2n1)N1CCN(CC1)C(C)C
Show InChI InChI=1S/C27H30F2N8O2/c1-15(2)36-10-12-37(13-11-36)16-4-6-19(21(14-16)39-3)33-27-34-25-17(8-9-31-25)26(35-27)32-20-7-5-18(28)23(29)22(20)24(30)38/h4-9,14-15H,10-13H2,1-3H3,(H2,30,38)(H3,31,32,33,34,35)
Reactome pathway
n/an/a 1.30n/an/an/an/an/an/a
GlaxoSmithKline
Curated by ChEMBL
Assay Description
Inhibition of IGF1R
Bioorg Med Chem Lett 19: 373-7 (2008)
Article DOI: 10.1016/j.bmcl.2008.11.065
BindingDB Entry DOI: 10.7270/Q2F190PC
Insulin-like growth factor I receptor
(Homo sapiens (Human))
BDBM27840
(2,3-difluoro-6-{[2-({2-methoxy-4-[4-(propan-2-yl)p...)
Show SMILES COc1cc(ccc1Nc1nc(Nc2ccc(F)c(F)c2C(N)=O)c2cc[nH]c2n1)N1CCN(CC1)C(C)C
Show InChI InChI=1S/C27H30F2N8O2/c1-15(2)36-10-12-37(13-11-36)16-4-6-19(21(14-16)39-3)33-27-34-25-17(8-9-31-25)26(35-27)32-20-7-5-18(28)23(29)22(20)24(30)38/h4-9,14-15H,10-13H2,1-3H3,(H2,30,38)(H3,31,32,33,34,35)
Reactome pathway
n/an/a 1.30n/an/an/an/a7.522
GSK
Assay Description
Assays are performed in 384-well microtiter plates in reaction buffer containing biotinylated substrate, ATP, and purified activated GST-IGF-1R in th...
Bioorg Med Chem Lett 19: 469-73 (2009)
Article DOI: 10.1016/j.bmcl.2008.11.046
BindingDB Entry DOI: 10.7270/Q2J67F88