null
SMILES: CCC1COC(=O)N1c1cc(NCc2cnn(C)c2)c2n(nc(C)c2n1)C(C)C
InChI Key: InChIKey=CVOILQIVJFYVAQ-UHFFFAOYSA-N
Activity Spreadsheet -- Enzyme Inhibition Constant Data from BindingDB
Found 21 hits for monomerid = 279125
Trg + Lig
Ki
nM
ΔG°
kcal/mole
IC50
nM
Kd
nM
EC50/IC50
nM
koff
s-1
kon
M-1s-1
pHTemp
°C
Dual specificity calcium/calmodulin-dependent 3',5'-cyclic nucleotide phosphodiesterase 1A
(Homo sapiens (Human))
BDBM279125
(4-ethyl-3-[1-isopropyl-3-methyl-7-[(1-methylpyrazo...)
Show SMILES CCC1COC(=O)N1c1cc(NCc2cnn(C)c2)c2n(nc(C)c2n1)C(C)C
Show InChI InChI=1S/C20H27N7O2/c1-6-15-11-29-20(28)26(15)17-7-16(21-8-14-9-22-25(5)10-14)19-18(23-17)13(4)24-27(19)12(2)3/h7,9-10,12,15H,6,8,11H2,1-5H3,(H,21,23)
US Patent
n/an/a 31n/an/an/an/a7.625
H. Lundbeck A/S
US Patent
Assay Description
PDE1A, PDE1B and PDE1C assays were performed as follows: the assays was performed in 60 μL samples containing a fixed amount of the PDE1 enzyme ...
US Patent US10034861 (2018)
BindingDB Entry DOI: 10.7270/Q2X350HN
Dual specificity calcium/calmodulin-dependent 3',5'-cyclic nucleotide phosphodiesterase 1C
(Homo sapiens (Human))
BDBM279125
(4-ethyl-3-[1-isopropyl-3-methyl-7-[(1-methylpyrazo...)
Show SMILES CCC1COC(=O)N1c1cc(NCc2cnn(C)c2)c2n(nc(C)c2n1)C(C)C
Show InChI InChI=1S/C20H27N7O2/c1-6-15-11-29-20(28)26(15)17-7-16(21-8-14-9-22-25(5)10-14)19-18(23-17)13(4)24-27(19)12(2)3/h7,9-10,12,15H,6,8,11H2,1-5H3,(H,21,23)
n/an/a 5.10n/an/an/an/an/an/a
TBA
Citation and Details
BindingDB Entry DOI: 10.7270/Q26977HV
Dual specificity calcium/calmodulin-dependent 3',5'-cyclic nucleotide phosphodiesterase 1C
(Homo sapiens (Human))
BDBM279125
(4-ethyl-3-[1-isopropyl-3-methyl-7-[(1-methylpyrazo...)
Show SMILES CCC1COC(=O)N1c1cc(NCc2cnn(C)c2)c2n(nc(C)c2n1)C(C)C
Show InChI InChI=1S/C20H27N7O2/c1-6-15-11-29-20(28)26(15)17-7-16(21-8-14-9-22-25(5)10-14)19-18(23-17)13(4)24-27(19)12(2)3/h7,9-10,12,15H,6,8,11H2,1-5H3,(H,21,23)
US Patent
n/an/a 5.10n/an/an/an/a7.625
H. Lundbeck A/S
US Patent
Assay Description
PDE1A, PDE1B and PDE1C assays were performed as follows: the assays was performed in 60 μL samples containing a fixed amount of the PDE1 enzyme ...
US Patent US10034861 (2018)
BindingDB Entry DOI: 10.7270/Q2X350HN
Dual specificity calcium/calmodulin-dependent 3',5'-cyclic nucleotide phosphodiesterase 1A
(Homo sapiens (Human))
BDBM279125
(4-ethyl-3-[1-isopropyl-3-methyl-7-[(1-methylpyrazo...)
Show SMILES CCC1COC(=O)N1c1cc(NCc2cnn(C)c2)c2n(nc(C)c2n1)C(C)C
Show InChI InChI=1S/C20H27N7O2/c1-6-15-11-29-20(28)26(15)17-7-16(21-8-14-9-22-25(5)10-14)19-18(23-17)13(4)24-27(19)12(2)3/h7,9-10,12,15H,6,8,11H2,1-5H3,(H,21,23)
US Patent
n/an/a 31n/an/an/an/an/an/a
H. Lundbeck A/S
US Patent
Assay Description
PDE1A, PDE1B and PDE1C assays were performed as follows: the assays was performed in 60 μL samples containing a fixed amount of the PDE1 enzyme ...
US Patent US10512632 (2019)
BindingDB Entry DOI: 10.7270/Q25T3NVN
Dual specificity calcium/calmodulin-dependent 3',5'-cyclic nucleotide phosphodiesterase 1B
(Homo sapiens (Human))
BDBM279125
(4-ethyl-3-[1-isopropyl-3-methyl-7-[(1-methylpyrazo...)
Show SMILES CCC1COC(=O)N1c1cc(NCc2cnn(C)c2)c2n(nc(C)c2n1)C(C)C
Show InChI InChI=1S/C20H27N7O2/c1-6-15-11-29-20(28)26(15)17-7-16(21-8-14-9-22-25(5)10-14)19-18(23-17)13(4)24-27(19)12(2)3/h7,9-10,12,15H,6,8,11H2,1-5H3,(H,21,23)
Reactome pathway
US Patent
n/an/a 31n/an/an/an/an/an/a
H. Lundbeck A/S
US Patent
Assay Description
PDE1A, PDE1B and PDE1C assays were performed as follows: the assays was performed in 60 μL samples containing a fixed amount of the PDE1 enzyme ...
US Patent US10512632 (2019)
BindingDB Entry DOI: 10.7270/Q25T3NVN
Dual specificity calcium/calmodulin-dependent 3',5'-cyclic nucleotide phosphodiesterase 1C
(Homo sapiens (Human))
BDBM279125
(4-ethyl-3-[1-isopropyl-3-methyl-7-[(1-methylpyrazo...)
Show SMILES CCC1COC(=O)N1c1cc(NCc2cnn(C)c2)c2n(nc(C)c2n1)C(C)C
Show InChI InChI=1S/C20H27N7O2/c1-6-15-11-29-20(28)26(15)17-7-16(21-8-14-9-22-25(5)10-14)19-18(23-17)13(4)24-27(19)12(2)3/h7,9-10,12,15H,6,8,11H2,1-5H3,(H,21,23)
US Patent
n/an/a 5.10n/an/an/an/an/an/a
H. Lundbeck A/S
US Patent
Assay Description
PDE1A, PDE1B and PDE1C assays were performed as follows: the assays was performed in 60 μL samples containing a fixed amount of the PDE1 enzyme ...
US Patent US10512632 (2019)
BindingDB Entry DOI: 10.7270/Q25T3NVN
Dual specificity calcium/calmodulin-dependent 3',5'-cyclic nucleotide phosphodiesterase 1A
(Homo sapiens (Human))
BDBM279125
(4-ethyl-3-[1-isopropyl-3-methyl-7-[(1-methylpyrazo...)
Show SMILES CCC1COC(=O)N1c1cc(NCc2cnn(C)c2)c2n(nc(C)c2n1)C(C)C
Show InChI InChI=1S/C20H27N7O2/c1-6-15-11-29-20(28)26(15)17-7-16(21-8-14-9-22-25(5)10-14)19-18(23-17)13(4)24-27(19)12(2)3/h7,9-10,12,15H,6,8,11H2,1-5H3,(H,21,23)
US Patent
n/an/a 31n/an/an/an/an/an/a
H. Lundbeck A/S
US Patent
Assay Description
PDE1A, PDE1B and PDE1C assays were performed as follows: the assays were performed in 60 μL samples containing a fixed amount of the PDE1 enzyme...
US Patent US10766893 (2020)
BindingDB Entry DOI: 10.7270/Q2ZP495P
Dual specificity calcium/calmodulin-dependent 3',5'-cyclic nucleotide phosphodiesterase 1B
(Homo sapiens (Human))
BDBM279125
(4-ethyl-3-[1-isopropyl-3-methyl-7-[(1-methylpyrazo...)
Show SMILES CCC1COC(=O)N1c1cc(NCc2cnn(C)c2)c2n(nc(C)c2n1)C(C)C
Show InChI InChI=1S/C20H27N7O2/c1-6-15-11-29-20(28)26(15)17-7-16(21-8-14-9-22-25(5)10-14)19-18(23-17)13(4)24-27(19)12(2)3/h7,9-10,12,15H,6,8,11H2,1-5H3,(H,21,23)
Reactome pathway
US Patent
n/an/a 31n/an/an/an/an/an/a
H. Lundbeck A/S
US Patent
Assay Description
PDE1A, PDE1B and PDE1C assays were performed as follows: the assays were performed in 60 μL samples containing a fixed amount of the PDE1 enzyme...
US Patent US10766893 (2020)
BindingDB Entry DOI: 10.7270/Q2ZP495P
Dual specificity calcium/calmodulin-dependent 3',5'-cyclic nucleotide phosphodiesterase 1C
(Homo sapiens (Human))
BDBM279125
(4-ethyl-3-[1-isopropyl-3-methyl-7-[(1-methylpyrazo...)
Show SMILES CCC1COC(=O)N1c1cc(NCc2cnn(C)c2)c2n(nc(C)c2n1)C(C)C
Show InChI InChI=1S/C20H27N7O2/c1-6-15-11-29-20(28)26(15)17-7-16(21-8-14-9-22-25(5)10-14)19-18(23-17)13(4)24-27(19)12(2)3/h7,9-10,12,15H,6,8,11H2,1-5H3,(H,21,23)
US Patent
n/an/a 5.10n/an/an/an/an/an/a
H. Lundbeck A/S
US Patent
Assay Description
PDE1A, PDE1B and PDE1C assays were performed as follows: the assays were performed in 60 μL samples containing a fixed amount of the PDE1 enzyme...
US Patent US10766893 (2020)
BindingDB Entry DOI: 10.7270/Q2ZP495P
Dual specificity calcium/calmodulin-dependent 3',5'-cyclic nucleotide phosphodiesterase 1A
(Homo sapiens (Human))
BDBM279125
(4-ethyl-3-[1-isopropyl-3-methyl-7-[(1-methylpyrazo...)
Show SMILES CCC1COC(=O)N1c1cc(NCc2cnn(C)c2)c2n(nc(C)c2n1)C(C)C
Show InChI InChI=1S/C20H27N7O2/c1-6-15-11-29-20(28)26(15)17-7-16(21-8-14-9-22-25(5)10-14)19-18(23-17)13(4)24-27(19)12(2)3/h7,9-10,12,15H,6,8,11H2,1-5H3,(H,21,23)
US Patent
n/an/a 31n/an/an/an/an/an/a
H. Lundbeck A/S
US Patent
Assay Description
PDE1A, PDE1B and PDE1C assays were performed as follows: the assays was performed in 60 μL samples containing a fixed amount of the PDE1 enzyme ...
US Patent US10806718 (2020)
BindingDB Entry DOI: 10.7270/Q27P92FR
Dual specificity calcium/calmodulin-dependent 3',5'-cyclic nucleotide phosphodiesterase 1B
(Homo sapiens (Human))
BDBM279125
(4-ethyl-3-[1-isopropyl-3-methyl-7-[(1-methylpyrazo...)
Show SMILES CCC1COC(=O)N1c1cc(NCc2cnn(C)c2)c2n(nc(C)c2n1)C(C)C
Show InChI InChI=1S/C20H27N7O2/c1-6-15-11-29-20(28)26(15)17-7-16(21-8-14-9-22-25(5)10-14)19-18(23-17)13(4)24-27(19)12(2)3/h7,9-10,12,15H,6,8,11H2,1-5H3,(H,21,23)
Reactome pathway
US Patent
n/an/a 31n/an/an/an/an/an/a
H. Lundbeck A/S
US Patent
Assay Description
PDE1A, PDE1B and PDE1C assays were performed as follows: the assays was performed in 60 μL samples containing a fixed amount of the PDE1 enzyme ...
US Patent US10806718 (2020)
BindingDB Entry DOI: 10.7270/Q27P92FR
Dual specificity calcium/calmodulin-dependent 3',5'-cyclic nucleotide phosphodiesterase 1C
(Homo sapiens (Human))
BDBM279125
(4-ethyl-3-[1-isopropyl-3-methyl-7-[(1-methylpyrazo...)
Show SMILES CCC1COC(=O)N1c1cc(NCc2cnn(C)c2)c2n(nc(C)c2n1)C(C)C
Show InChI InChI=1S/C20H27N7O2/c1-6-15-11-29-20(28)26(15)17-7-16(21-8-14-9-22-25(5)10-14)19-18(23-17)13(4)24-27(19)12(2)3/h7,9-10,12,15H,6,8,11H2,1-5H3,(H,21,23)
US Patent
n/an/a 5.10n/an/an/an/an/an/a
H. Lundbeck A/S
US Patent
Assay Description
PDE1A, PDE1B and PDE1C assays were performed as follows: the assays was performed in 60 μL samples containing a fixed amount of the PDE1 enzyme ...
US Patent US10806718 (2020)
BindingDB Entry DOI: 10.7270/Q27P92FR
Dual specificity calcium/calmodulin-dependent 3',5'-cyclic nucleotide phosphodiesterase 1A
(Homo sapiens (Human))
BDBM279125
(4-ethyl-3-[1-isopropyl-3-methyl-7-[(1-methylpyrazo...)
Show SMILES CCC1COC(=O)N1c1cc(NCc2cnn(C)c2)c2n(nc(C)c2n1)C(C)C
Show InChI InChI=1S/C20H27N7O2/c1-6-15-11-29-20(28)26(15)17-7-16(21-8-14-9-22-25(5)10-14)19-18(23-17)13(4)24-27(19)12(2)3/h7,9-10,12,15H,6,8,11H2,1-5H3,(H,21,23)
US Patent
n/an/a 31n/an/an/an/an/an/a
H. Lundbeck A/S
US Patent
Assay Description
PDE1A, PDE1B and PDE1C assays were performed as follows: the assays was performed in 60 uL samples containing a fixed amount of the PDE1 enzyme (suff...
US Patent US11026923 (2021)
BindingDB Entry DOI: 10.7270/Q20R9SJ9
Dual specificity calcium/calmodulin-dependent 3',5'-cyclic nucleotide phosphodiesterase 1B
(Homo sapiens (Human))
BDBM279125
(4-ethyl-3-[1-isopropyl-3-methyl-7-[(1-methylpyrazo...)
Show SMILES CCC1COC(=O)N1c1cc(NCc2cnn(C)c2)c2n(nc(C)c2n1)C(C)C
Show InChI InChI=1S/C20H27N7O2/c1-6-15-11-29-20(28)26(15)17-7-16(21-8-14-9-22-25(5)10-14)19-18(23-17)13(4)24-27(19)12(2)3/h7,9-10,12,15H,6,8,11H2,1-5H3,(H,21,23)
Reactome pathway
US Patent
n/an/a 31n/an/an/an/an/an/a
H. Lundbeck A/S
US Patent
Assay Description
PDE1A, PDE1B and PDE1C assays were performed as follows: the assays was performed in 60 uL samples containing a fixed amount of the PDE1 enzyme (suff...
US Patent US11026923 (2021)
BindingDB Entry DOI: 10.7270/Q20R9SJ9
Dual specificity calcium/calmodulin-dependent 3',5'-cyclic nucleotide phosphodiesterase 1C
(Homo sapiens (Human))
BDBM279125
(4-ethyl-3-[1-isopropyl-3-methyl-7-[(1-methylpyrazo...)
Show SMILES CCC1COC(=O)N1c1cc(NCc2cnn(C)c2)c2n(nc(C)c2n1)C(C)C
Show InChI InChI=1S/C20H27N7O2/c1-6-15-11-29-20(28)26(15)17-7-16(21-8-14-9-22-25(5)10-14)19-18(23-17)13(4)24-27(19)12(2)3/h7,9-10,12,15H,6,8,11H2,1-5H3,(H,21,23)
US Patent
n/an/a 5.10n/an/an/an/an/an/a
H. Lundbeck A/S
US Patent
Assay Description
PDE1A, PDE1B and PDE1C assays were performed as follows: the assays was performed in 60 uL samples containing a fixed amount of the PDE1 enzyme (suff...
US Patent US11026923 (2021)
BindingDB Entry DOI: 10.7270/Q20R9SJ9
Dual specificity calcium/calmodulin-dependent 3',5'-cyclic nucleotide phosphodiesterase 1A
(Homo sapiens (Human))
BDBM279125
(4-ethyl-3-[1-isopropyl-3-methyl-7-[(1-methylpyrazo...)
Show SMILES CCC1COC(=O)N1c1cc(NCc2cnn(C)c2)c2n(nc(C)c2n1)C(C)C
Show InChI InChI=1S/C20H27N7O2/c1-6-15-11-29-20(28)26(15)17-7-16(21-8-14-9-22-25(5)10-14)19-18(23-17)13(4)24-27(19)12(2)3/h7,9-10,12,15H,6,8,11H2,1-5H3,(H,21,23)
US Patent
n/an/a 31n/an/an/an/an/an/a
TBA
Assay Description
PDE1A, PDE1B and PDE1C assays were performed as follows: the assays was performed in 60 μL samples containing a fixed amount of the PDE1 enzyme ...
Citation and Details
BindingDB Entry DOI: 10.7270/Q2R78K2T
Dual specificity calcium/calmodulin-dependent 3',5'-cyclic nucleotide phosphodiesterase 1B
(Homo sapiens (Human))
BDBM279125
(4-ethyl-3-[1-isopropyl-3-methyl-7-[(1-methylpyrazo...)
Show SMILES CCC1COC(=O)N1c1cc(NCc2cnn(C)c2)c2n(nc(C)c2n1)C(C)C
Show InChI InChI=1S/C20H27N7O2/c1-6-15-11-29-20(28)26(15)17-7-16(21-8-14-9-22-25(5)10-14)19-18(23-17)13(4)24-27(19)12(2)3/h7,9-10,12,15H,6,8,11H2,1-5H3,(H,21,23)
Reactome pathway
US Patent
n/an/a 31n/an/an/an/an/an/a
TBA
Assay Description
PDE1A, PDE1B and PDE1C assays were performed as follows: the assays was performed in 60 μL samples containing a fixed amount of the PDE1 enzyme ...
Citation and Details
BindingDB Entry DOI: 10.7270/Q2R78K2T
Dual specificity calcium/calmodulin-dependent 3',5'-cyclic nucleotide phosphodiesterase 1C
(Homo sapiens (Human))
BDBM279125
(4-ethyl-3-[1-isopropyl-3-methyl-7-[(1-methylpyrazo...)
Show SMILES CCC1COC(=O)N1c1cc(NCc2cnn(C)c2)c2n(nc(C)c2n1)C(C)C
Show InChI InChI=1S/C20H27N7O2/c1-6-15-11-29-20(28)26(15)17-7-16(21-8-14-9-22-25(5)10-14)19-18(23-17)13(4)24-27(19)12(2)3/h7,9-10,12,15H,6,8,11H2,1-5H3,(H,21,23)
US Patent
n/an/a 5.10n/an/an/an/an/an/a
TBA
Assay Description
PDE1A, PDE1B and PDE1C assays were performed as follows: the assays was performed in 60 μL samples containing a fixed amount of the PDE1 enzyme ...
Citation and Details
BindingDB Entry DOI: 10.7270/Q2R78K2T
Dual specificity calcium/calmodulin-dependent 3',5'-cyclic nucleotide phosphodiesterase 1A
(Homo sapiens (Human))
BDBM279125
(4-ethyl-3-[1-isopropyl-3-methyl-7-[(1-methylpyrazo...)
Show SMILES CCC1COC(=O)N1c1cc(NCc2cnn(C)c2)c2n(nc(C)c2n1)C(C)C
Show InChI InChI=1S/C20H27N7O2/c1-6-15-11-29-20(28)26(15)17-7-16(21-8-14-9-22-25(5)10-14)19-18(23-17)13(4)24-27(19)12(2)3/h7,9-10,12,15H,6,8,11H2,1-5H3,(H,21,23)
n/an/a 31n/an/an/an/an/an/a
TBA
Citation and Details
BindingDB Entry DOI: 10.7270/Q26977HV
Dual specificity calcium/calmodulin-dependent 3',5'-cyclic nucleotide phosphodiesterase 1B
(Homo sapiens (Human))
BDBM279125
(4-ethyl-3-[1-isopropyl-3-methyl-7-[(1-methylpyrazo...)
Show SMILES CCC1COC(=O)N1c1cc(NCc2cnn(C)c2)c2n(nc(C)c2n1)C(C)C
Show InChI InChI=1S/C20H27N7O2/c1-6-15-11-29-20(28)26(15)17-7-16(21-8-14-9-22-25(5)10-14)19-18(23-17)13(4)24-27(19)12(2)3/h7,9-10,12,15H,6,8,11H2,1-5H3,(H,21,23)
Reactome pathway
n/an/a 31n/an/an/an/an/an/a
TBA
Citation and Details
BindingDB Entry DOI: 10.7270/Q26977HV
Dual specificity calcium/calmodulin-dependent 3',5'-cyclic nucleotide phosphodiesterase 1B
(Homo sapiens (Human))
BDBM279125
(4-ethyl-3-[1-isopropyl-3-methyl-7-[(1-methylpyrazo...)
Show SMILES CCC1COC(=O)N1c1cc(NCc2cnn(C)c2)c2n(nc(C)c2n1)C(C)C
Show InChI InChI=1S/C20H27N7O2/c1-6-15-11-29-20(28)26(15)17-7-16(21-8-14-9-22-25(5)10-14)19-18(23-17)13(4)24-27(19)12(2)3/h7,9-10,12,15H,6,8,11H2,1-5H3,(H,21,23)
Reactome pathway
US Patent
n/an/a 31n/an/an/an/a7.625
H. Lundbeck A/S
US Patent
Assay Description
PDE1A, PDE1B and PDE1C assays were performed as follows: the assays was performed in 60 μL samples containing a fixed amount of the PDE1 enzyme ...
US Patent US10034861 (2018)
BindingDB Entry DOI: 10.7270/Q2X350HN