BDBM27924 Azabicyclooctane scaffold, 14g::N-[(3aR,6S,6aS)-1-[(2S)-3,3-dimethyl-2-[(2S)-2-(methylamino)propanamido]butanoyl]-octahydrocyclopenta[b]pyrrol-6-yl]benzamide
SMILES: [H][C@]12CC[C@H](NC(=O)c3ccccc3)[C@@]1([H])N(CC2)C(=O)[C@@H](NC(=O)[C@H](C)NC)C(C)(C)C
InChI Key: InChIKey=IWYPEHHCCCPVAX-HHUCQEJWSA-N
Data: 2 KI
PDB links: 1 PDB ID contains this monomer as substructures. 1 PDB ID contains inhibitors having a similarity of 90% to this monomer.
Activity Spreadsheet -- Enzyme Inhibition Constant Data from BindingDB
Found 2 hits for monomerid = 27924
Trg + Lig
Ki
nM
ΔG°
kcal/mole
IC50
nM
Kd
nM
EC50/IC50
nM
koff
s-1
kon
M-1s-1
pHTemp
°C
XIAP-BIR3
(Homo sapiens (Human))
BDBM27924
(Azabicyclooctane scaffold, 14g | N-[(3aR,6S,6aS)-1...)
Show SMILES [H][C@]12CC[C@H](NC(=O)c3ccccc3)[C@@]1([H])N(CC2)C(=O)[C@@H](NC(=O)[C@H](C)NC)C(C)(C)C |r|
Show InChI InChI=1S/C24H36N4O3/c1-15(25-5)21(29)27-20(24(2,3)4)23(31)28-14-13-16-11-12-18(19(16)28)26-22(30)17-9-7-6-8-10-17/h6-10,15-16,18-20,25H,11-14H2,1-5H3,(H,26,30)(H,27,29)/t15-,16+,18-,19-,20+/m0/s1
Reactome pathway
500n/an/an/an/an/an/an/an/a
Genentech, Inc.
Assay Description
Samples for fluorescence polarization affinity measurements were prepared by addition of serial dilutions of target protein to each well containing a...
J Med Chem 52: 1723-30 (2009)
Article DOI: 10.1021/jm801450c
BindingDB Entry DOI: 10.7270/Q2WH2N9H
ML-IAP-BIR
(Homo sapiens (Human))
BDBM27924
(Azabicyclooctane scaffold, 14g | N-[(3aR,6S,6aS)-1...)
Show SMILES [H][C@]12CC[C@H](NC(=O)c3ccccc3)[C@@]1([H])N(CC2)C(=O)[C@@H](NC(=O)[C@H](C)NC)C(C)(C)C |r|
Show InChI InChI=1S/C24H36N4O3/c1-15(25-5)21(29)27-20(24(2,3)4)23(31)28-14-13-16-11-12-18(19(16)28)26-22(30)17-9-7-6-8-10-17/h6-10,15-16,18-20,25H,11-14H2,1-5H3,(H,26,30)(H,27,29)/t15-,16+,18-,19-,20+/m0/s1
1.00E+3 -8.10n/an/an/an/an/a7.222
Genentech, Inc.
Assay Description
Samples for fluorescence polarization affinity measurements were prepared by addition of serial dilutions of target protein to each well containing a...
J Med Chem 52: 1723-30 (2009)
Article DOI: 10.1021/jm801450c
BindingDB Entry DOI: 10.7270/Q2WH2N9H
3D
3D Structure (docked)