BDBM27930 Azabicyclooctane scaffold, 14m::N-[(3aR,6S,6aS)-1-[(2S)-3,3-dimethyl-2-[(2S)-2-(methylamino)propanamido]butanoyl]-octahydrocyclopenta[b]pyrrol-6-yl]-1H-1,3-benzodiazole-5-carboxamide
SMILES: [H][C@]12CC[C@H](NC(=O)c3ccc4nc[nH]c4c3)[C@@]1([H])N(CC2)C(=O)[C@@H](NC(=O)[C@H](C)NC)C(C)(C)C
InChI Key: InChIKey=HBIHHTINCMTJSZ-MXUFIIGOSA-N
Data: 2 KI
Activity Spreadsheet -- Enzyme Inhibition Constant Data from BindingDB
Found 2 hits for monomerid = 27930
Trg + Lig
Ki
nM
ΔG°
kcal/mole
IC50
nM
Kd
nM
EC50/IC50
nM
koff
s-1
kon
M-1s-1
pHTemp
°C
Complex of Baculoviral IAP repeat-containing protein 7 [63-159,S150G] and E3 ubiquitin-protein ligase XIAP [336-348]
(Homo sapiens (Human))
BDBM27930
(Azabicyclooctane scaffold, 14m | N-[(3aR,6S,6aS)-1...)
Show SMILES [H][C@]12CC[C@H](NC(=O)c3ccc4nc[nH]c4c3)[C@@]1([H])N(CC2)C(=O)[C@@H](NC(=O)[C@H](C)NC)C(C)(C)C |r|
Show InChI InChI=1S/C25H36N6O3/c1-14(26-5)22(32)30-21(25(2,3)4)24(34)31-11-10-15-6-9-18(20(15)31)29-23(33)16-7-8-17-19(12-16)28-13-27-17/h7-8,12-15,18,20-21,26H,6,9-11H2,1-5H3,(H,27,28)(H,29,33)(H,30,32)/t14-,15+,18-,20-,21+/m0/s1
1.70E+3 -7.79n/an/an/an/an/a7.222
Genentech, Inc.
Assay Description
Samples for fluorescence polarization affinity measurements were prepared by addition of serial dilutions of target protein to each well containing a...
J Med Chem 52: 1723-30 (2009)
Article DOI: 10.1021/jm801450c
BindingDB Entry DOI: 10.7270/Q2WH2N9H
3D
3D Structure (docked)
E3 ubiquitin-protein ligase XIAP [241-356]
(Homo sapiens (Human))
BDBM27930
(Azabicyclooctane scaffold, 14m | N-[(3aR,6S,6aS)-1...)
Show SMILES [H][C@]12CC[C@H](NC(=O)c3ccc4nc[nH]c4c3)[C@@]1([H])N(CC2)C(=O)[C@@H](NC(=O)[C@H](C)NC)C(C)(C)C |r|
Show InChI InChI=1S/C25H36N6O3/c1-14(26-5)22(32)30-21(25(2,3)4)24(34)31-11-10-15-6-9-18(20(15)31)29-23(33)16-7-8-17-19(12-16)28-13-27-17/h7-8,12-15,18,20-21,26H,6,9-11H2,1-5H3,(H,27,28)(H,29,33)(H,30,32)/t14-,15+,18-,20-,21+/m0/s1
Reactome pathway
1.43E+4n/an/an/an/an/an/an/an/a
Genentech, Inc.
Assay Description
Samples for fluorescence polarization affinity measurements were prepared by addition of serial dilutions of target protein to each well containing a...
J Med Chem 52: 1723-30 (2009)
Article DOI: 10.1021/jm801450c
BindingDB Entry DOI: 10.7270/Q2WH2N9H