null
SMILES: FC(F)(F)C(OC(=O)N1CCC2(CCCN2Cc2ccc(cc2N2CC3CCC(C2)O3)C(F)(F)F)CC1)C(F)(F)F
InChI Key: InChIKey=YZGYVCBVLMISEK-UHFFFAOYSA-N
Activity Spreadsheet -- Enzyme Inhibition Constant Data from BindingDB
Found 6 hits for monomerid = 280528
Trg + Lig
Ki
nM
ΔG°
kcal/mole
IC50
nM
Kd
nM
EC50/IC50
nM
koff
s-1
kon
M-1s-1
pHTemp
°C
Monoglyceride lipase
(Mus musculus (mouse))
BDBM280528
(US10030020, Example 73 | US10781211, Example 73)
Show SMILES FC(F)(F)C(OC(=O)N1CCC2(CCCN2Cc2ccc(cc2N2CC3CCC(C2)O3)C(F)(F)F)CC1)C(F)(F)F
Show InChI InChI=1S/C26H30F9N3O3/c27-24(28,29)17-3-2-16(20(12-17)37-14-18-4-5-19(15-37)40-18)13-38-9-1-6-23(38)7-10-36(11-8-23)22(39)41-21(25(30,31)32)26(33,34)35/h2-3,12,18-19,21H,1,4-11,13-15H2
Reactome pathway
US Patent
n/an/a<100n/an/an/an/an/an/a
ABIDE THERAPEUTICS, INC.
US Patent
Assay Description
Proteomes (mouse brain membrane fraction or cell lysates) (50 μL, 1.0 mg/mL total protein concentration) were preincubated with varying concentr...
US Patent US10030020 (2018)
BindingDB Entry DOI: 10.7270/Q2FX7CGF
Fatty-acid amide hydrolase 1
(Mus musculus (mouse))
BDBM280528
(US10030020, Example 73 | US10781211, Example 73)
Show SMILES FC(F)(F)C(OC(=O)N1CCC2(CCCN2Cc2ccc(cc2N2CC3CCC(C2)O3)C(F)(F)F)CC1)C(F)(F)F
Show InChI InChI=1S/C26H30F9N3O3/c27-24(28,29)17-3-2-16(20(12-17)37-14-18-4-5-19(15-37)40-18)13-38-9-1-6-23(38)7-10-36(11-8-23)22(39)41-21(25(30,31)32)26(33,34)35/h2-3,12,18-19,21H,1,4-11,13-15H2
US Patent
n/an/a>1.00E+3n/an/an/an/an/an/a
ABIDE THERAPEUTICS, INC.
US Patent
Assay Description
Proteomes (mouse brain membrane fraction or cell lysates) (50 μL, 1.0 mg/mL total protein concentration) were preincubated with varying concentr...
US Patent US10030020 (2018)
BindingDB Entry DOI: 10.7270/Q2FX7CGF
Monoacylglycerol lipase ABHD6
(Mus musculus (mouse))
BDBM280528
(US10030020, Example 73 | US10781211, Example 73)
Show SMILES FC(F)(F)C(OC(=O)N1CCC2(CCCN2Cc2ccc(cc2N2CC3CCC(C2)O3)C(F)(F)F)CC1)C(F)(F)F
Show InChI InChI=1S/C26H30F9N3O3/c27-24(28,29)17-3-2-16(20(12-17)37-14-18-4-5-19(15-37)40-18)13-38-9-1-6-23(38)7-10-36(11-8-23)22(39)41-21(25(30,31)32)26(33,34)35/h2-3,12,18-19,21H,1,4-11,13-15H2
US Patent
n/an/a>1.00E+3n/an/an/an/an/an/a
LUNDBECK LA JOLLA RESEARCH CENTER, INC.
US Patent
Assay Description
MAGL, ABHD6 and FAAH: Proteomes (mouse brain membrane fraction or cell lysates) (50 μL, 1.0 mg/mL total protein concentration) were preincubated...
US Patent US10781211 (2020)
Monoglyceride lipase
(Mus musculus (mouse))
BDBM280528
(US10030020, Example 73 | US10781211, Example 73)
Show SMILES FC(F)(F)C(OC(=O)N1CCC2(CCCN2Cc2ccc(cc2N2CC3CCC(C2)O3)C(F)(F)F)CC1)C(F)(F)F
Show InChI InChI=1S/C26H30F9N3O3/c27-24(28,29)17-3-2-16(20(12-17)37-14-18-4-5-19(15-37)40-18)13-38-9-1-6-23(38)7-10-36(11-8-23)22(39)41-21(25(30,31)32)26(33,34)35/h2-3,12,18-19,21H,1,4-11,13-15H2
Reactome pathway
US Patent
n/an/a<100n/an/an/an/an/an/a
LUNDBECK LA JOLLA RESEARCH CENTER, INC.
US Patent
Assay Description
MAGL, ABHD6 and FAAH: Proteomes (mouse brain membrane fraction or cell lysates) (50 μL, 1.0 mg/mL total protein concentration) were preincubated...
US Patent US10781211 (2020)
Fatty-acid amide hydrolase 1
(Mus musculus (mouse))
BDBM280528
(US10030020, Example 73 | US10781211, Example 73)
Show SMILES FC(F)(F)C(OC(=O)N1CCC2(CCCN2Cc2ccc(cc2N2CC3CCC(C2)O3)C(F)(F)F)CC1)C(F)(F)F
Show InChI InChI=1S/C26H30F9N3O3/c27-24(28,29)17-3-2-16(20(12-17)37-14-18-4-5-19(15-37)40-18)13-38-9-1-6-23(38)7-10-36(11-8-23)22(39)41-21(25(30,31)32)26(33,34)35/h2-3,12,18-19,21H,1,4-11,13-15H2
US Patent
n/an/a>1.00E+3n/an/an/an/an/an/a
LUNDBECK LA JOLLA RESEARCH CENTER, INC.
US Patent
Assay Description
MAGL, ABHD6 and FAAH: Proteomes (mouse brain membrane fraction or cell lysates) (50 μL, 1.0 mg/mL total protein concentration) were preincubated...
US Patent US10781211 (2020)
Monoacylglycerol lipase ABHD2
(Mus musculus (Mouse))
BDBM280528
(US10030020, Example 73 | US10781211, Example 73)
Show SMILES FC(F)(F)C(OC(=O)N1CCC2(CCCN2Cc2ccc(cc2N2CC3CCC(C2)O3)C(F)(F)F)CC1)C(F)(F)F
Show InChI InChI=1S/C26H30F9N3O3/c27-24(28,29)17-3-2-16(20(12-17)37-14-18-4-5-19(15-37)40-18)13-38-9-1-6-23(38)7-10-36(11-8-23)22(39)41-21(25(30,31)32)26(33,34)35/h2-3,12,18-19,21H,1,4-11,13-15H2
US Patent
n/an/a>1.00E+3n/an/an/an/an/an/a
ABIDE THERAPEUTICS, INC.
US Patent
Assay Description
Proteomes (mouse brain membrane fraction or cell lysates) (50 μL, 1.0 mg/mL total protein concentration) were preincubated with varying concentr...
US Patent US10030020 (2018)
BindingDB Entry DOI: 10.7270/Q2FX7CGF