BDBM28969 cyclohexyl sulfone-based compound, 12::methyl N-({4-[(4-chlorobenzene)sulfonyl]-4-(2,5-difluorophenyl)cyclohexyl}methyl)carbamate
SMILES: COC(=O)NC[C@H]1CC[C@@](CC1)(c1cc(F)ccc1F)S(=O)(=O)c1ccc(Cl)cc1
InChI Key: InChIKey=DHXZXBJVCDLRSD-QCKZDCLWSA-N
Data: 1 EC50
Activity Spreadsheet -- Enzyme Inhibition Constant Data from BindingDB
Found 1 hit for monomerid = 28969
Trg + Lig
Ki
nM
ΔG°
kcal/mole
IC50
nM
Kd
nM
EC50/IC50
nM
koff
s-1
kon
M-1s-1
pHTemp
°C
Gamma-secretase subunit APH-1A/Gamma-secretase subunit PEN-2/Nicastrin [34-709]/Presenilin-1
(Homo sapiens (Human))
BDBM28969
(cyclohexyl sulfone-based compound, 12 | methyl N-(...)
Show SMILES COC(=O)NC[C@H]1CC[C@@](CC1)(c1cc(F)ccc1F)S(=O)(=O)c1ccc(Cl)cc1 |r,wU:6.5,wD:9.12,(10.8,5.68,;9.47,4.91,;8.13,5.68,;8.13,7.22,;6.8,4.91,;5.47,5.68,;4.13,4.91,;4.13,3.37,;2.8,2.6,;1.47,3.37,;1.47,4.91,;2.8,5.68,;-.12,3.9,;-.12,5.44,;-1.46,6.21,;-1.46,7.75,;-2.79,5.44,;-2.79,3.9,;-1.46,3.13,;-1.46,1.59,;1.47,1.83,;3.01,1.83,;-.07,1.83,;1.47,.29,;.13,-.48,;.13,-2.02,;1.47,-2.79,;1.47,-4.33,;2.8,-2.02,;2.8,-.48,)|
Show InChI InChI=1S/C21H22ClF2NO4S/c1-29-20(26)25-13-14-8-10-21(11-9-14,18-12-16(23)4-7-19(18)24)30(27,28)17-5-2-15(22)3-6-17/h2-7,12,14H,8-11,13H2,1H3,(H,25,26)/t14-,21+
NCI pathway
Reactome pathway
n/an/an/an/a 2.20n/an/an/an/a
Merck Research Laboratories
Assay Description
A whole-cell gamma-secretase inhibition assay using SHSY5Y neuroblastoma cells in which human gamma-secretase catalyzes the breakdown of the overexpr...
Bioorg Med Chem Lett 16: 280-4 (2006)
Article DOI: 10.1016/j.bmcl.2005.10.009
BindingDB Entry DOI: 10.7270/Q22Z13VQ