null
SMILES: Fc1ccc(F)c(c1)[C@]1(CC[C@H](CS(=O)(=O)c2ccccn2)CC1)S(=O)(=O)c1ccc(Cl)cc1
InChI Key: InChIKey=BNRCMKYOGYXWND-SMQSCJQKSA-N
Activity Spreadsheet -- Enzyme Inhibition Constant Data from BindingDB
Found 1 hit for monomerid = 28977
Trg + Lig
Ki
nM
ΔG°
kcal/mole
IC50
nM
Kd
nM
EC50/IC50
nM
koff
s-1
kon
M-1s-1
pHTemp
°C
Gamma-secretase subunit APH-1A/Gamma-secretase subunit PEN-2/Nicastrin [34-709]/Presenilin-1
(Homo sapiens (Human))
BDBM28977
(2-[({4-[(4-chlorobenzene)sulfonyl]-4-(2,5-difluoro...)
Show SMILES Fc1ccc(F)c(c1)[C@]1(CC[C@H](CS(=O)(=O)c2ccccn2)CC1)S(=O)(=O)c1ccc(Cl)cc1 |r,wU:11.12,wD:8.8,(-1.46,7.75,;-1.46,6.21,;-2.79,5.44,;-2.79,3.9,;-1.46,3.13,;-1.46,1.59,;-.12,3.9,;-.12,5.44,;1.47,3.37,;2.8,2.6,;4.13,3.37,;4.13,4.91,;5.47,5.68,;6.8,4.91,;6.03,3.58,;7.89,3.82,;8.13,5.68,;8.13,7.22,;9.47,7.99,;10.8,7.22,;10.8,5.68,;9.47,4.91,;2.8,5.68,;1.47,4.91,;1.47,1.83,;3.01,1.83,;-.07,1.83,;1.47,.29,;.13,-.48,;.13,-2.02,;1.47,-2.79,;1.47,-4.33,;2.8,-2.02,;2.8,-.48,)|
Show InChI InChI=1S/C24H22ClF2NO4S2/c25-18-4-7-20(8-5-18)34(31,32)24(21-15-19(26)6-9-22(21)27)12-10-17(11-13-24)16-33(29,30)23-3-1-2-14-28-23/h1-9,14-15,17H,10-13,16H2/t17-,24+
NCI pathway
Reactome pathway
n/an/an/an/a 2.10n/an/an/an/a
Merck Research Laboratories
Assay Description
A whole-cell gamma-secretase inhibition assay using SHSY5Y neuroblastoma cells in which human gamma-secretase catalyzes the breakdown of the overexpr...
Bioorg Med Chem Lett 16: 280-4 (2006)
Article DOI: 10.1016/j.bmcl.2005.10.009
BindingDB Entry DOI: 10.7270/Q22Z13VQ