BDBM28980 1-[({4-[(4-chlorobenzene)sulfonyl]-4-(2,5-difluorophenyl)cyclohexyl}methane)sulfonyl]azetidine::cyclohexyl sulfone-based compound, 24
SMILES: Fc1ccc(F)c(c1)[C@]1(CC[C@H](CS(=O)(=O)N2CCC2)CC1)S(=O)(=O)c1ccc(Cl)cc1
InChI Key: InChIKey=OFTOYMCRCCAFGE-MIRVZWSXSA-N
Data: 1 EC50
Activity Spreadsheet -- Enzyme Inhibition Constant Data from BindingDB
Found 1 hit for monomerid = 28980
Trg + Lig
Ki
nM
ΔG°
kcal/mole
IC50
nM
Kd
nM
EC50/IC50
nM
koff
s-1
kon
M-1s-1
pHTemp
°C
Gamma-Secretase
(Homo sapiens (Human))
BDBM28980
(1-[({4-[(4-chlorobenzene)sulfonyl]-4-(2,5-difluoro...)
Show SMILES Fc1ccc(F)c(c1)[C@]1(CC[C@H](CS(=O)(=O)N2CCC2)CC1)S(=O)(=O)c1ccc(Cl)cc1 |r,wU:11.12,wD:8.8,(-1.46,7.75,;-1.46,6.21,;-2.79,5.44,;-2.79,3.9,;-1.46,3.13,;-1.46,1.59,;-.12,3.9,;-.12,5.44,;1.47,3.37,;2.8,2.6,;4.13,3.37,;4.13,4.91,;5.47,5.68,;6.8,4.91,;6.03,3.58,;7.89,3.82,;8.13,5.68,;8.13,7.22,;9.67,7.22,;9.67,5.68,;2.8,5.68,;1.47,4.91,;1.47,1.83,;3.01,1.83,;-.07,1.83,;1.47,.29,;.13,-.48,;.13,-2.02,;1.47,-2.79,;1.47,-4.33,;2.8,-2.02,;2.8,-.48,)|
Show InChI InChI=1S/C22H24ClF2NO4S2/c23-17-2-5-19(6-3-17)32(29,30)22(20-14-18(24)4-7-21(20)25)10-8-16(9-11-22)15-31(27,28)26-12-1-13-26/h2-7,14,16H,1,8-13,15H2/t16-,22+
NCI pathway
Reactome pathway
n/an/an/an/a 0.360n/an/an/an/a
Merck Research Laboratories
Assay Description
A whole-cell gamma-secretase inhibition assay using SHSY5Y neuroblastoma cells in which human gamma-secretase catalyzes the breakdown of the overexpr...
Bioorg Med Chem Lett 16: 280-4 (2006)
Article DOI: 10.1016/j.bmcl.2005.10.009
BindingDB Entry DOI: 10.7270/Q22Z13VQ