BDBM28986 N-{4-[(4-chlorobenzene)sulfonyl]-4-(2,5-difluorophenyl)cyclohexyl}trifluoromethanesulfonamide::cyclohexyl sulfone-based compound, 32
SMILES: Fc1ccc(F)c(c1)[C@]1(CC[C@@H](CC1)NS(=O)(=O)C(F)(F)F)S(=O)(=O)c1ccc(Cl)cc1
InChI Key: InChIKey=WDZVWDXOIGQJIO-UJKQEGAGSA-N
Data: 10 IC50  1 EC50
Activity Spreadsheet -- Enzyme Inhibition Constant Data from BindingDB
Found 11 hits for monomerid = 28986
Trg + Lig
Ki
nM
ΔG°
kcal/mole
IC50
nM
Kd
nM
EC50/IC50
nM
koff
s-1
kon
M-1s-1
pHTemp
°C
Gamma-Secretase
(Homo sapiens (Human))
BDBM28986
(N-{4-[(4-chlorobenzene)sulfonyl]-4-(2,5-difluoroph...)
Show SMILES Fc1ccc(F)c(c1)[C@]1(CC[C@@H](CC1)NS(=O)(=O)C(F)(F)F)S(=O)(=O)c1ccc(Cl)cc1 |r,wU:11.15,wD:8.8,(-1.46,7.75,;-1.46,6.21,;-2.79,5.44,;-2.79,3.9,;-1.46,3.13,;-1.46,1.59,;-.12,3.9,;-.12,5.44,;1.47,3.37,;2.8,2.6,;4.13,3.37,;4.13,4.91,;2.8,5.68,;1.47,4.91,;5.47,5.68,;5.47,7.22,;3.98,7.62,;5.47,8.76,;6.95,7.62,;6.75,9.15,;7.16,6.09,;8.44,8.02,;1.47,1.83,;3.01,1.83,;-.07,1.83,;1.47,.29,;.13,-.48,;.13,-2.02,;1.47,-2.79,;1.47,-4.33,;2.8,-2.02,;2.8,-.48,)|
Show InChI InChI=1S/C19H17ClF5NO4S2/c20-12-1-4-15(5-2-12)31(27,28)18(16-11-13(21)3-6-17(16)22)9-7-14(8-10-18)26-32(29,30)19(23,24)25/h1-6,11,14,26H,7-10H2/t14-,18+
NCI pathway
Reactome pathway
n/an/an/an/a 0.650n/an/an/an/a
Merck Research Laboratories
Assay Description
A whole-cell gamma-secretase inhibition assay using SHSY5Y neuroblastoma cells in which human gamma-secretase catalyzes the breakdown of the overexpr...
Bioorg Med Chem Lett 16: 280-4 (2006)
Article DOI: 10.1016/j.bmcl.2005.10.009
BindingDB Entry DOI: 10.7270/Q22Z13VQ
Cytochrome P450 3A4
(Homo sapiens (Human))
BDBM28986
(N-{4-[(4-chlorobenzene)sulfonyl]-4-(2,5-difluoroph...)
Show SMILES Fc1ccc(F)c(c1)[C@]1(CC[C@@H](CC1)NS(=O)(=O)C(F)(F)F)S(=O)(=O)c1ccc(Cl)cc1 |r,wU:11.15,wD:8.8,(-1.46,7.75,;-1.46,6.21,;-2.79,5.44,;-2.79,3.9,;-1.46,3.13,;-1.46,1.59,;-.12,3.9,;-.12,5.44,;1.47,3.37,;2.8,2.6,;4.13,3.37,;4.13,4.91,;2.8,5.68,;1.47,4.91,;5.47,5.68,;5.47,7.22,;3.98,7.62,;5.47,8.76,;6.95,7.62,;6.75,9.15,;7.16,6.09,;8.44,8.02,;1.47,1.83,;3.01,1.83,;-.07,1.83,;1.47,.29,;.13,-.48,;.13,-2.02,;1.47,-2.79,;1.47,-4.33,;2.8,-2.02,;2.8,-.48,)|
Show InChI InChI=1S/C19H17ClF5NO4S2/c20-12-1-4-15(5-2-12)31(27,28)18(16-11-13(21)3-6-17(16)22)9-7-14(8-10-18)26-32(29,30)19(23,24)25/h1-6,11,14,26H,7-10H2/t14-,18+
Reactome pathway
n/an/a 9.30E+3n/an/an/an/an/an/a
Merck Research Laboratories
Curated by ChEMBL
Assay Description
Inhibition of CYP3A4 (unknown origin) preincubated with protein for 30 mins followed by substrate addition
J Med Chem 58: 8806-17 (2015)
BindingDB Entry DOI: 10.7270/Q2HQ41R9
Cytochrome P450 2D6
(Homo sapiens (Human))
BDBM28986
(N-{4-[(4-chlorobenzene)sulfonyl]-4-(2,5-difluoroph...)
Show SMILES Fc1ccc(F)c(c1)[C@]1(CC[C@@H](CC1)NS(=O)(=O)C(F)(F)F)S(=O)(=O)c1ccc(Cl)cc1 |r,wU:11.15,wD:8.8,(-1.46,7.75,;-1.46,6.21,;-2.79,5.44,;-2.79,3.9,;-1.46,3.13,;-1.46,1.59,;-.12,3.9,;-.12,5.44,;1.47,3.37,;2.8,2.6,;4.13,3.37,;4.13,4.91,;2.8,5.68,;1.47,4.91,;5.47,5.68,;5.47,7.22,;3.98,7.62,;5.47,8.76,;6.95,7.62,;6.75,9.15,;7.16,6.09,;8.44,8.02,;1.47,1.83,;3.01,1.83,;-.07,1.83,;1.47,.29,;.13,-.48,;.13,-2.02,;1.47,-2.79,;1.47,-4.33,;2.8,-2.02,;2.8,-.48,)|
Show InChI InChI=1S/C19H17ClF5NO4S2/c20-12-1-4-15(5-2-12)31(27,28)18(16-11-13(21)3-6-17(16)22)9-7-14(8-10-18)26-32(29,30)19(23,24)25/h1-6,11,14,26H,7-10H2/t14-,18+
n/an/a>3.00E+4n/an/an/an/an/an/a
Merck Research Laboratories
Curated by ChEMBL
Assay Description
Inhibition of CYP2D6 (unknown origin) co-incubated with substrate and protein
J Med Chem 58: 8806-17 (2015)
BindingDB Entry DOI: 10.7270/Q2HQ41R9
Cytochrome P450 2D6
(Homo sapiens (Human))
BDBM28986
(N-{4-[(4-chlorobenzene)sulfonyl]-4-(2,5-difluoroph...)
Show SMILES Fc1ccc(F)c(c1)[C@]1(CC[C@@H](CC1)NS(=O)(=O)C(F)(F)F)S(=O)(=O)c1ccc(Cl)cc1 |r,wU:11.15,wD:8.8,(-1.46,7.75,;-1.46,6.21,;-2.79,5.44,;-2.79,3.9,;-1.46,3.13,;-1.46,1.59,;-.12,3.9,;-.12,5.44,;1.47,3.37,;2.8,2.6,;4.13,3.37,;4.13,4.91,;2.8,5.68,;1.47,4.91,;5.47,5.68,;5.47,7.22,;3.98,7.62,;5.47,8.76,;6.95,7.62,;6.75,9.15,;7.16,6.09,;8.44,8.02,;1.47,1.83,;3.01,1.83,;-.07,1.83,;1.47,.29,;.13,-.48,;.13,-2.02,;1.47,-2.79,;1.47,-4.33,;2.8,-2.02,;2.8,-.48,)|
Show InChI InChI=1S/C19H17ClF5NO4S2/c20-12-1-4-15(5-2-12)31(27,28)18(16-11-13(21)3-6-17(16)22)9-7-14(8-10-18)26-32(29,30)19(23,24)25/h1-6,11,14,26H,7-10H2/t14-,18+
n/an/a>3.00E+4n/an/an/an/an/an/a
Merck Research Laboratories
Curated by ChEMBL
Assay Description
Inhibition of CYP2D6 (unknown origin) preincubated with protein for 30 mins followed by substrate addition
J Med Chem 58: 8806-17 (2015)
BindingDB Entry DOI: 10.7270/Q2HQ41R9
Cytochrome P450 2C9
(Homo sapiens (Human))
BDBM28986
(N-{4-[(4-chlorobenzene)sulfonyl]-4-(2,5-difluoroph...)
Show SMILES Fc1ccc(F)c(c1)[C@]1(CC[C@@H](CC1)NS(=O)(=O)C(F)(F)F)S(=O)(=O)c1ccc(Cl)cc1 |r,wU:11.15,wD:8.8,(-1.46,7.75,;-1.46,6.21,;-2.79,5.44,;-2.79,3.9,;-1.46,3.13,;-1.46,1.59,;-.12,3.9,;-.12,5.44,;1.47,3.37,;2.8,2.6,;4.13,3.37,;4.13,4.91,;2.8,5.68,;1.47,4.91,;5.47,5.68,;5.47,7.22,;3.98,7.62,;5.47,8.76,;6.95,7.62,;6.75,9.15,;7.16,6.09,;8.44,8.02,;1.47,1.83,;3.01,1.83,;-.07,1.83,;1.47,.29,;.13,-.48,;.13,-2.02,;1.47,-2.79,;1.47,-4.33,;2.8,-2.02,;2.8,-.48,)|
Show InChI InChI=1S/C19H17ClF5NO4S2/c20-12-1-4-15(5-2-12)31(27,28)18(16-11-13(21)3-6-17(16)22)9-7-14(8-10-18)26-32(29,30)19(23,24)25/h1-6,11,14,26H,7-10H2/t14-,18+
Reactome pathway
n/an/a<300n/an/an/an/an/an/a
Merck Research Laboratories
Curated by ChEMBL
Assay Description
Inhibition of CYP2C9 (unknown origin) co-incubated with substrate and protein
J Med Chem 58: 8806-17 (2015)
BindingDB Entry DOI: 10.7270/Q2HQ41R9
Presenilin-1
(Homo sapiens (Human))
BDBM28986
(N-{4-[(4-chlorobenzene)sulfonyl]-4-(2,5-difluoroph...)
Show SMILES Fc1ccc(F)c(c1)[C@]1(CC[C@@H](CC1)NS(=O)(=O)C(F)(F)F)S(=O)(=O)c1ccc(Cl)cc1 |r,wU:11.15,wD:8.8,(-1.46,7.75,;-1.46,6.21,;-2.79,5.44,;-2.79,3.9,;-1.46,3.13,;-1.46,1.59,;-.12,3.9,;-.12,5.44,;1.47,3.37,;2.8,2.6,;4.13,3.37,;4.13,4.91,;2.8,5.68,;1.47,4.91,;5.47,5.68,;5.47,7.22,;3.98,7.62,;5.47,8.76,;6.95,7.62,;6.75,9.15,;7.16,6.09,;8.44,8.02,;1.47,1.83,;3.01,1.83,;-.07,1.83,;1.47,.29,;.13,-.48,;.13,-2.02,;1.47,-2.79,;1.47,-4.33,;2.8,-2.02,;2.8,-.48,)|
Show InChI InChI=1S/C19H17ClF5NO4S2/c20-12-1-4-15(5-2-12)31(27,28)18(16-11-13(21)3-6-17(16)22)9-7-14(8-10-18)26-32(29,30)19(23,24)25/h1-6,11,14,26H,7-10H2/t14-,18+
n/an/a 65n/an/an/an/an/an/a
Centre Hospitalier Universitaire Vaudois (CHUV)
Curated by ChEMBL
Assay Description
Inhibition of gamma secretase in HEK293 cells expressing APP assessed as reduction in amyloid beta levels
J Med Chem 59: 7719-37 (2016)
Article DOI: 10.1021/acs.jmedchem.5b01516
Cytochrome P450 3A4
(Homo sapiens (Human))
BDBM28986
(N-{4-[(4-chlorobenzene)sulfonyl]-4-(2,5-difluoroph...)
Show SMILES Fc1ccc(F)c(c1)[C@]1(CC[C@@H](CC1)NS(=O)(=O)C(F)(F)F)S(=O)(=O)c1ccc(Cl)cc1 |r,wU:11.15,wD:8.8,(-1.46,7.75,;-1.46,6.21,;-2.79,5.44,;-2.79,3.9,;-1.46,3.13,;-1.46,1.59,;-.12,3.9,;-.12,5.44,;1.47,3.37,;2.8,2.6,;4.13,3.37,;4.13,4.91,;2.8,5.68,;1.47,4.91,;5.47,5.68,;5.47,7.22,;3.98,7.62,;5.47,8.76,;6.95,7.62,;6.75,9.15,;7.16,6.09,;8.44,8.02,;1.47,1.83,;3.01,1.83,;-.07,1.83,;1.47,.29,;.13,-.48,;.13,-2.02,;1.47,-2.79,;1.47,-4.33,;2.8,-2.02,;2.8,-.48,)|
Show InChI InChI=1S/C19H17ClF5NO4S2/c20-12-1-4-15(5-2-12)31(27,28)18(16-11-13(21)3-6-17(16)22)9-7-14(8-10-18)26-32(29,30)19(23,24)25/h1-6,11,14,26H,7-10H2/t14-,18+
Reactome pathway
n/an/a 1.66E+4n/an/an/an/an/an/a
Merck Research Laboratories
Curated by ChEMBL
Assay Description
Inhibition of CYP3A4 (unknown origin) co-incubated with substrate and protein
J Med Chem 58: 8806-17 (2015)
BindingDB Entry DOI: 10.7270/Q2HQ41R9
Gamma-Secretase Subunit APH-1A/Gamma-Secretase Subunit PEN-2/Gamma-Secretase Subunit Presenilin-1/Gamma-secretase subunit APH-1B/Nicastrin /Presenilin 2
(Homo sapiens (Human))
BDBM28986
(N-{4-[(4-chlorobenzene)sulfonyl]-4-(2,5-difluoroph...)
Show SMILES Fc1ccc(F)c(c1)[C@]1(CC[C@@H](CC1)NS(=O)(=O)C(F)(F)F)S(=O)(=O)c1ccc(Cl)cc1 |r,wU:11.15,wD:8.8,(-1.46,7.75,;-1.46,6.21,;-2.79,5.44,;-2.79,3.9,;-1.46,3.13,;-1.46,1.59,;-.12,3.9,;-.12,5.44,;1.47,3.37,;2.8,2.6,;4.13,3.37,;4.13,4.91,;2.8,5.68,;1.47,4.91,;5.47,5.68,;5.47,7.22,;3.98,7.62,;5.47,8.76,;6.95,7.62,;6.75,9.15,;7.16,6.09,;8.44,8.02,;1.47,1.83,;3.01,1.83,;-.07,1.83,;1.47,.29,;.13,-.48,;.13,-2.02,;1.47,-2.79,;1.47,-4.33,;2.8,-2.02,;2.8,-.48,)|
Show InChI InChI=1S/C19H17ClF5NO4S2/c20-12-1-4-15(5-2-12)31(27,28)18(16-11-13(21)3-6-17(16)22)9-7-14(8-10-18)26-32(29,30)19(23,24)25/h1-6,11,14,26H,7-10H2/t14-,18+
n/an/a 14n/an/an/an/an/an/a
Merck Research Laboratories
Curated by ChEMBL
Assay Description
Inhibition of gamma-secretase in HEK293 cell membranes using SPC99-Lon as substrate assessed as formation of amyloid beta 40 after 1 hr by electroche...
J Med Chem 58: 8806-17 (2015)
BindingDB Entry DOI: 10.7270/Q2HQ41R9
Gamma-Secretase Subunit APH-1A/Gamma-Secretase Subunit PEN-2/Gamma-Secretase Subunit Presenilin-1/Gamma-secretase subunit APH-1B/Nicastrin /Presenilin 2
(Homo sapiens (Human))
BDBM28986
(N-{4-[(4-chlorobenzene)sulfonyl]-4-(2,5-difluoroph...)
Show SMILES Fc1ccc(F)c(c1)[C@]1(CC[C@@H](CC1)NS(=O)(=O)C(F)(F)F)S(=O)(=O)c1ccc(Cl)cc1 |r,wU:11.15,wD:8.8,(-1.46,7.75,;-1.46,6.21,;-2.79,5.44,;-2.79,3.9,;-1.46,3.13,;-1.46,1.59,;-.12,3.9,;-.12,5.44,;1.47,3.37,;2.8,2.6,;4.13,3.37,;4.13,4.91,;2.8,5.68,;1.47,4.91,;5.47,5.68,;5.47,7.22,;3.98,7.62,;5.47,8.76,;6.95,7.62,;6.75,9.15,;7.16,6.09,;8.44,8.02,;1.47,1.83,;3.01,1.83,;-.07,1.83,;1.47,.29,;.13,-.48,;.13,-2.02,;1.47,-2.79,;1.47,-4.33,;2.8,-2.02,;2.8,-.48,)|
Show InChI InChI=1S/C19H17ClF5NO4S2/c20-12-1-4-15(5-2-12)31(27,28)18(16-11-13(21)3-6-17(16)22)9-7-14(8-10-18)26-32(29,30)19(23,24)25/h1-6,11,14,26H,7-10H2/t14-,18+
n/an/a 15n/an/an/an/an/an/a
Merck Research Laboratories
Curated by ChEMBL
Assay Description
Inhibition of gamma-secretase in HEK293 cells using human APP Swedish/London double mutant as substrate assessed as formation of amyloid beta 40 afte...
J Med Chem 58: 8806-17 (2015)
BindingDB Entry DOI: 10.7270/Q2HQ41R9
Gamma-Secretase Subunit APH-1A/Gamma-Secretase Subunit PEN-2/Gamma-Secretase Subunit Presenilin-1/Gamma-secretase subunit APH-1B/Nicastrin /Presenilin 2
(Homo sapiens (Human))
BDBM28986
(N-{4-[(4-chlorobenzene)sulfonyl]-4-(2,5-difluoroph...)
Show SMILES Fc1ccc(F)c(c1)[C@]1(CC[C@@H](CC1)NS(=O)(=O)C(F)(F)F)S(=O)(=O)c1ccc(Cl)cc1 |r,wU:11.15,wD:8.8,(-1.46,7.75,;-1.46,6.21,;-2.79,5.44,;-2.79,3.9,;-1.46,3.13,;-1.46,1.59,;-.12,3.9,;-.12,5.44,;1.47,3.37,;2.8,2.6,;4.13,3.37,;4.13,4.91,;2.8,5.68,;1.47,4.91,;5.47,5.68,;5.47,7.22,;3.98,7.62,;5.47,8.76,;6.95,7.62,;6.75,9.15,;7.16,6.09,;8.44,8.02,;1.47,1.83,;3.01,1.83,;-.07,1.83,;1.47,.29,;.13,-.48,;.13,-2.02,;1.47,-2.79,;1.47,-4.33,;2.8,-2.02,;2.8,-.48,)|
Show InChI InChI=1S/C19H17ClF5NO4S2/c20-12-1-4-15(5-2-12)31(27,28)18(16-11-13(21)3-6-17(16)22)9-7-14(8-10-18)26-32(29,30)19(23,24)25/h1-6,11,14,26H,7-10H2/t14-,18+
n/an/a 5n/an/an/an/an/an/a
Merck Research Laboratories
Curated by ChEMBL
Assay Description
Inhibition of gamma-secretase in HEK293 cells using human APP Swedish/London double mutant as substrate assessed as formation of amyloid beta 42 afte...
J Med Chem 58: 8806-17 (2015)
BindingDB Entry DOI: 10.7270/Q2HQ41R9
Cytochrome P450 2C9
(Homo sapiens (Human))
BDBM28986
(N-{4-[(4-chlorobenzene)sulfonyl]-4-(2,5-difluoroph...)
Show SMILES Fc1ccc(F)c(c1)[C@]1(CC[C@@H](CC1)NS(=O)(=O)C(F)(F)F)S(=O)(=O)c1ccc(Cl)cc1 |r,wU:11.15,wD:8.8,(-1.46,7.75,;-1.46,6.21,;-2.79,5.44,;-2.79,3.9,;-1.46,3.13,;-1.46,1.59,;-.12,3.9,;-.12,5.44,;1.47,3.37,;2.8,2.6,;4.13,3.37,;4.13,4.91,;2.8,5.68,;1.47,4.91,;5.47,5.68,;5.47,7.22,;3.98,7.62,;5.47,8.76,;6.95,7.62,;6.75,9.15,;7.16,6.09,;8.44,8.02,;1.47,1.83,;3.01,1.83,;-.07,1.83,;1.47,.29,;.13,-.48,;.13,-2.02,;1.47,-2.79,;1.47,-4.33,;2.8,-2.02,;2.8,-.48,)|
Show InChI InChI=1S/C19H17ClF5NO4S2/c20-12-1-4-15(5-2-12)31(27,28)18(16-11-13(21)3-6-17(16)22)9-7-14(8-10-18)26-32(29,30)19(23,24)25/h1-6,11,14,26H,7-10H2/t14-,18+
Reactome pathway
n/an/a<300n/an/an/an/an/an/a
Merck Research Laboratories
Curated by ChEMBL
Assay Description
Inhibition of CYP2C9 (unknown origin) preincubated with protein for 30 mins followed by substrate addition
J Med Chem 58: 8806-17 (2015)
BindingDB Entry DOI: 10.7270/Q2HQ41R9