BDBM291813 N-((5-fluoro-2,3-dihydrobenzofuran-4-yl)methyl)-8-(2-methyl-4-(methylsulfonyl)phenyl)-[1,2,4]triazolo[4,3-c]pyrimidin-5-amine::US9580437, Example 128
SMILES: Cc1cc(ccc1-c1cnc(NCc2c3CCOc3ccc2F)n2cnnc12)S(C)(=O)=O
InChI Key: InChIKey=IPNXCHNXDBXYIB-UHFFFAOYSA-N
Data: 3 IC50
Activity Spreadsheet -- Enzyme Inhibition Constant Data from BindingDB
Found 6 hits for monomerid = 291813
Trg + Lig
Ki
nM
ΔG°
kcal/mole
IC50
nM
Kd
nM
EC50/IC50
nM
koff
s-1
kon
M-1s-1
pHTemp
°C
Polycomb Repressive Complex 2 (PRC2)
(Homo sapiens (Human))
BDBM291813
(N-((5-fluoro-2,3-dihydrobenzofuran-4-yl)methyl)-8-...)
Show SMILES Cc1cc(ccc1-c1cnc(NCc2c3CCOc3ccc2F)n2cnnc12)S(C)(=O)=O
Show InChI InChI=1S/C22H20FN5O3S/c1-13-9-14(32(2,29)30)3-4-15(13)18-11-25-22(28-12-26-27-21(18)28)24-10-17-16-7-8-31-20(16)6-5-19(17)23/h3-6,9,11-12H,7-8,10H2,1-2H3,(H,24,25)
US Patent
n/an/a 8.60n/an/an/an/a8.0n/a
Novartis AG
US Patent
Assay Description
To assess the compounds potency in the EED-H3K27Me3 competition binding assay, compounds were serially diluted 3-fold in DMSO to obtain a total of tw...
US Patent US9580437 (2017)
BindingDB Entry DOI: 10.7270/Q24T6MD7
Polycomb Repressive Complex 2 (PRC2)
(Homo sapiens (Human))
BDBM291813
(N-((5-fluoro-2,3-dihydrobenzofuran-4-yl)methyl)-8-...)
Show SMILES Cc1cc(ccc1-c1cnc(NCc2c3CCOc3ccc2F)n2cnnc12)S(C)(=O)=O
Show InChI InChI=1S/C22H20FN5O3S/c1-13-9-14(32(2,29)30)3-4-15(13)18-11-25-22(28-12-26-27-21(18)28)24-10-17-16-7-8-31-20(16)6-5-19(17)23/h3-6,9,11-12H,7-8,10H2,1-2H3,(H,24,25)
US Patent
n/an/a 16.5n/an/an/an/a8.0n/a
Novartis AG
US Patent
Assay Description
Representative compounds of the present disclosure were serially and separately diluted 3-fold in DMSO to obtain a total of eight or twelve concentra...
US Patent US9580437 (2017)
BindingDB Entry DOI: 10.7270/Q24T6MD7
Polycomb protein EED
(Homo sapiens (Human))
BDBM291813
(N-((5-fluoro-2,3-dihydrobenzofuran-4-yl)methyl)-8-...)
Show SMILES Cc1cc(ccc1-c1cnc(NCc2c3CCOc3ccc2F)n2cnnc12)S(C)(=O)=O
Show InChI InChI=1S/C22H20FN5O3S/c1-13-9-14(32(2,29)30)3-4-15(13)18-11-25-22(28-12-26-27-21(18)28)24-10-17-16-7-8-31-20(16)6-5-19(17)23/h3-6,9,11-12H,7-8,10H2,1-2H3,(H,24,25)
n/an/a 3.70n/an/an/an/an/an/a
TBA
Citation and Details
Polycomb protein EED
(Homo sapiens (Human))
BDBM291813
(N-((5-fluoro-2,3-dihydrobenzofuran-4-yl)methyl)-8-...)
Show SMILES Cc1cc(ccc1-c1cnc(NCc2c3CCOc3ccc2F)n2cnnc12)S(C)(=O)=O
Show InChI InChI=1S/C22H20FN5O3S/c1-13-9-14(32(2,29)30)3-4-15(13)18-11-25-22(28-12-26-27-21(18)28)24-10-17-16-7-8-31-20(16)6-5-19(17)23/h3-6,9,11-12H,7-8,10H2,1-2H3,(H,24,25)
n/an/a 8.60n/an/an/an/an/an/a
TBA
Citation and Details
Polycomb protein EED
(Homo sapiens (Human))
BDBM291813
(N-((5-fluoro-2,3-dihydrobenzofuran-4-yl)methyl)-8-...)
Show SMILES Cc1cc(ccc1-c1cnc(NCc2c3CCOc3ccc2F)n2cnnc12)S(C)(=O)=O
Show InChI InChI=1S/C22H20FN5O3S/c1-13-9-14(32(2,29)30)3-4-15(13)18-11-25-22(28-12-26-27-21(18)28)24-10-17-16-7-8-31-20(16)6-5-19(17)23/h3-6,9,11-12H,7-8,10H2,1-2H3,(H,24,25)
n/an/a 16.5n/an/an/an/an/an/a
TBA
Citation and Details
Polycomb Repressive Complex 2 (PRC2)
(Homo sapiens (Human))
BDBM291813
(N-((5-fluoro-2,3-dihydrobenzofuran-4-yl)methyl)-8-...)
Show SMILES Cc1cc(ccc1-c1cnc(NCc2c3CCOc3ccc2F)n2cnnc12)S(C)(=O)=O
Show InChI InChI=1S/C22H20FN5O3S/c1-13-9-14(32(2,29)30)3-4-15(13)18-11-25-22(28-12-26-27-21(18)28)24-10-17-16-7-8-31-20(16)6-5-19(17)23/h3-6,9,11-12H,7-8,10H2,1-2H3,(H,24,25)
US Patent
n/an/a 3.70n/an/an/an/an/an/a
Novartis AG
US Patent
Assay Description
Cell lysates were transferred to the wells of a 384-well plate and the final volume was adjusted to 50 μL per well with PBS. The plate was seale...
US Patent US9580437 (2017)
BindingDB Entry DOI: 10.7270/Q24T6MD7