BDBM29253 quinolinone, 24
SMILES: Cc1noc(C)c1C(=O)N(Cc1cc(=O)[nH]c2c(F)cccc12)c1cccc(Cl)c1
InChI Key: InChIKey=WGIGFPRNVPLYPO-UHFFFAOYSA-N
Data: 3 EC50
Activity Spreadsheet -- Enzyme Inhibition Constant Data from BindingDB
Found 3 hits for monomerid = 29253
Trg + Lig
Ki
nM
ΔG°
kcal/mole
IC50
nM
Kd
nM
EC50/IC50
nM
koff
s-1
kon
M-1s-1
pHTemp
°C
Nitric oxide synthase, inducible
(Homo sapiens (Human))
BDBM29253
(quinolinone, 24)
Show SMILES Cc1noc(C)c1C(=O)N(Cc1cc(=O)[nH]c2c(F)cccc12)c1cccc(Cl)c1
Show InChI InChI=1S/C22H17ClFN3O3/c1-12-20(13(2)30-26-12)22(29)27(16-6-3-5-15(23)10-16)11-14-9-19(28)25-21-17(14)7-4-8-18(21)24/h3-10H,11H2,1-2H3,(H,25,28)
NCI pathway
Reactome pathway
n/an/an/an/a 16n/an/an/a25
Kalypsys Inc.
Assay Description
HEK293 cells (ATCC) were transiently transfected with recombinant NOS and grown. Cells were trypsinized, resuspended to 5 00,000 cells/mL, and plated...
J Med Chem 52: 3047-62 (2009)
Article DOI: 10.1021/jm900173b
BindingDB Entry DOI: 10.7270/Q2D798RB
Nitric oxide synthase, brain
(Homo sapiens (Human))
BDBM29253
(quinolinone, 24)
Show SMILES Cc1noc(C)c1C(=O)N(Cc1cc(=O)[nH]c2c(F)cccc12)c1cccc(Cl)c1
Show InChI InChI=1S/C22H17ClFN3O3/c1-12-20(13(2)30-26-12)22(29)27(16-6-3-5-15(23)10-16)11-14-9-19(28)25-21-17(14)7-4-8-18(21)24/h3-10H,11H2,1-2H3,(H,25,28)
Reactome pathway
n/an/an/an/a 500n/an/an/a25
Kalypsys Inc.
Assay Description
HEK293 cells (ATCC) were transiently transfected with recombinant NOS and grown. Cells were trypsinized, resuspended to 5 00,000 cells/mL, and plated...
J Med Chem 52: 3047-62 (2009)
Article DOI: 10.1021/jm900173b
BindingDB Entry DOI: 10.7270/Q2D798RB
Nitric oxide synthase, endothelial
(Homo sapiens (Human))
BDBM29253
(quinolinone, 24)
Show SMILES Cc1noc(C)c1C(=O)N(Cc1cc(=O)[nH]c2c(F)cccc12)c1cccc(Cl)c1
Show InChI InChI=1S/C22H17ClFN3O3/c1-12-20(13(2)30-26-12)22(29)27(16-6-3-5-15(23)10-16)11-14-9-19(28)25-21-17(14)7-4-8-18(21)24/h3-10H,11H2,1-2H3,(H,25,28)
n/an/an/an/a 6.80E+3n/an/an/a25
Kalypsys Inc.
Assay Description
HEK293 cells (ATCC) were transiently transfected with recombinant NOS and grown. Cells were trypsinized, resuspended to 5 00,000 cells/mL, and plated...
J Med Chem 52: 3047-62 (2009)
Article DOI: 10.1021/jm900173b
BindingDB Entry DOI: 10.7270/Q2D798RB