null
SMILES: O=C(Nc1ccncc1)C1c2ccccc2Oc2ccccc12
InChI Key: InChIKey=MGHLZEVMIBMMIV-UHFFFAOYSA-N
Activity Spreadsheet -- Enzyme Inhibition Constant Data from BindingDB
Found 1 hit for monomerid = 29341
Trg + Lig
Ki
nM
ΔG°
kcal/mole
IC50
nM
Kd
nM
EC50/IC50
nM
koff
s-1
kon
M-1s-1
pHTemp
°C
Sterol 14-alpha demethylase
(Trypanosoma cruzi)
BDBM29341
(ChemDiv 5556-0480, 7)
Show SMILES O=C(Nc1ccncc1)C1c2ccccc2Oc2ccccc12
Show InChI InChI=1S/C19H14N2O2/c22-19(21-13-9-11-20-12-10-13)18-14-5-1-3-7-16(14)23-17-8-4-2-6-15(17)18/h1-12,18H,(H,20,21,22)
n/an/an/a 750n/an/an/a7.424
Vanderbilt University
Assay Description
As a cysteine-coordinated hemoprotein, sterol 14-alpha-demethylase responds spectrally to any perturbations in the area surrounding the heme iron. Th...
J Med Chem 52: 2846-53 (2009)
Article DOI: 10.1021/jm801643b
BindingDB Entry DOI: 10.7270/Q2MP51MG