BDBM29596 benzylidenehydrazine derivative, 13
SMILES: CN(C)c1ccc(C=NNC(=O)CCCCCC(=O)NO)c(O)c1
InChI Key: InChIKey=QKGYKPDKVJSTLU-UHFFFAOYSA-N
Data: 1 IC50
Activity Spreadsheet -- Enzyme Inhibition Constant Data from BindingDB
Found 1 hit for monomerid = 29596
Trg + Lig
Ki
nM
ΔG°
kcal/mole
IC50
nM
Kd
nM
EC50/IC50
nM
koff
s-1
kon
M-1s-1
pHTemp
°C
Histone deacetylase
(Plasmodium falciparum (isolate 3D7))
BDBM29596
(benzylidenehydrazine derivative, 13)
Show SMILES CN(C)c1ccc(C=NNC(=O)CCCCCC(=O)NO)c(O)c1 |w:7.6|
Show InChI InChI=1S/C16H24N4O4/c1-20(2)13-9-8-12(14(21)10-13)11-17-18-15(22)6-4-3-5-7-16(23)19-24/h8-11,21,24H,3-7H2,1-2H3,(H,18,22)(H,19,23)
n/an/a 37n/an/an/an/a7.523
Harvard Medical School
Assay Description
Recombinant pfHDAC-1 was assayed with substrate in the presence of test compound. The substrate concentration was kept constant at 125 uM while the c...
J Med Chem 52: 2185-7 (2009)
Article DOI: 10.1021/jm801654y
BindingDB Entry DOI: 10.7270/Q26H4FRD