BDBM30181 Pyrrolopyridine, 12
SMILES: O=C1NCCc2[nH]c(cc12)-c1ccnc(c1)-c1cncnc1
InChI Key: InChIKey=PBXJEGAZNPWTKA-UHFFFAOYSA-N
Data: 1 IC50
Activity Spreadsheet -- Enzyme Inhibition Constant Data from BindingDB
Found 1 hit for monomerid = 30181
Trg + Lig
Ki
nM
ΔG°
kcal/mole
IC50
nM
Kd
nM
EC50/IC50
nM
koff
s-1
kon
M-1s-1
pHTemp
°C
MAP kinase-activated protein kinase 2
(Homo sapiens (Human))
BDBM30181
(Pyrrolopyridine, 12)
Show SMILES O=C1NCCc2[nH]c(cc12)-c1ccnc(c1)-c1cncnc1
Show InChI InChI=1S/C16H13N5O/c22-16-12-6-15(21-13(12)2-4-20-16)10-1-3-19-14(5-10)11-7-17-9-18-8-11/h1,3,5-9,21H,2,4H2,(H,20,22)
NCI pathway
Reactome pathway
n/an/a 83n/an/an/an/a7.530
Pfizer
Assay Description
The phosphorylation of HSP27 peptide by MAPKAPK2 was measured using an anion exchange resin capture assay method. The reaction was carried out in rea...
J Med Chem 50: 2647-54 (2007)
Article DOI: 10.1021/jm0611004
BindingDB Entry DOI: 10.7270/Q2794313
3D
3D Structure (docked)