BDBM30182 Pyrrolopyridine, 13
SMILES: O=C1NCCc2[nH]c(cc12)-c1ccnc(c1)-c1ccsc1
InChI Key: InChIKey=WZGXWJDLVSXDQC-UHFFFAOYSA-N
Data: 1 IC50
Activity Spreadsheet -- Enzyme Inhibition Constant Data from BindingDB
Found 1 hit for monomerid = 30182
Trg + Lig
Ki
nM
ΔG°
kcal/mole
IC50
nM
Kd
nM
EC50/IC50
nM
koff
s-1
kon
M-1s-1
pHTemp
°C
MAP kinase-activated protein kinase 2
(Homo sapiens (Human))
BDBM30182
(Pyrrolopyridine, 13)
Show SMILES O=C1NCCc2[nH]c(cc12)-c1ccnc(c1)-c1ccsc1
Show InChI InChI=1S/C16H13N3OS/c20-16-12-8-15(19-13(12)2-5-18-16)10-1-4-17-14(7-10)11-3-6-21-9-11/h1,3-4,6-9,19H,2,5H2,(H,18,20)
NCI pathway
Reactome pathway
n/an/a 76n/an/an/an/a7.530
Pfizer
Assay Description
The phosphorylation of HSP27 peptide by MAPKAPK2 was measured using an anion exchange resin capture assay method. The reaction was carried out in rea...
J Med Chem 50: 2647-54 (2007)
Article DOI: 10.1021/jm0611004
BindingDB Entry DOI: 10.7270/Q2794313