BDBM30195 Pyrrolopyridine, 26
SMILES: FC(F)(F)c1ccc(cc1)-c1cc(ccn1)-c1cc2c(CCNC2=O)[nH]1
InChI Key: InChIKey=IQFURFKRHVLOTG-UHFFFAOYSA-N
Data: 1 IC50
Activity Spreadsheet -- Enzyme Inhibition Constant Data from BindingDB
Found 1 hit for monomerid = 30195
Trg + Lig
Ki
nM
ΔG°
kcal/mole
IC50
nM
Kd
nM
EC50/IC50
nM
koff
s-1
kon
M-1s-1
pHTemp
°C
MAP kinase-activated protein kinase 2
(Homo sapiens (Human))
BDBM30195
(Pyrrolopyridine, 26)
Show SMILES FC(F)(F)c1ccc(cc1)-c1cc(ccn1)-c1cc2c(CCNC2=O)[nH]1
Show InChI InChI=1S/C19H14F3N3O/c20-19(21,22)13-3-1-11(2-4-13)16-9-12(5-7-23-16)17-10-14-15(25-17)6-8-24-18(14)26/h1-5,7,9-10,25H,6,8H2,(H,24,26)
NCI pathway
Reactome pathway
n/an/a 71n/an/an/an/a7.530
Pfizer
Assay Description
The phosphorylation of HSP27 peptide by MAPKAPK2 was measured using an anion exchange resin capture assay method. The reaction was carried out in rea...
J Med Chem 50: 2647-54 (2007)
Article DOI: 10.1021/jm0611004
BindingDB Entry DOI: 10.7270/Q2794313
3D
3D Structure (docked)