BDBM30356 BOC-piperidinyl glycine derivative, 31
SMILES: CN(C)c1ccc(cc1)-c1ccc(cc1)S(=O)(=O)N[C@H](C1CCN(CC1)C(=O)OC(C)(C)C)C(O)=O
InChI Key: InChIKey=FQWZTIDTWFNEQD-HSZRJFAPSA-N
Data: 1 IC50
Activity Spreadsheet -- Enzyme Inhibition Constant Data from BindingDB
Found 1 hit for monomerid = 30356
Trg + Lig
Ki
nM
ΔG°
kcal/mole
IC50
nM
Kd
nM
EC50/IC50
nM
koff
s-1
kon
M-1s-1
pHTemp
°C
Collagenase 3
(Homo sapiens (Human))
BDBM30356
(BOC-piperidinyl glycine derivative, 31)
Show SMILES CN(C)c1ccc(cc1)-c1ccc(cc1)S(=O)(=O)N[C@H](C1CCN(CC1)C(=O)OC(C)(C)C)C(O)=O |r|
Show InChI InChI=1S/C26H35N3O6S/c1-26(2,3)35-25(32)29-16-14-20(15-17-29)23(24(30)31)27-36(33,34)22-12-8-19(9-13-22)18-6-10-21(11-7-18)28(4)5/h6-13,20,23,27H,14-17H2,1-5H3,(H,30,31)/t23-/m1/s1
NCI pathway
Reactome pathway
n/an/a 0.300n/an/an/an/a7.522
Novartis
Assay Description
Test compounds were serially diluted in the assay buffer. In each well of a 96-well microtiter plate (Immunofluor B, Dynatech), the inhibitor solutio...
J Med Chem 52: 3523-38 (2009)
Article DOI: 10.1021/jm801394m
BindingDB Entry DOI: 10.7270/Q2B27SN3