BDBM30364 piperidinyl glycine derivative, 24a
SMILES: CC(C)OC(=O)N1CCC(CC1)[C@@H](NS(=O)(=O)c1ccc(s1)-c1ccc(cc1)N1CCCCC1)C(O)=O
InChI Key: InChIKey=URSSKCFDTXBION-XMMPIXPASA-N
Data: 2 IC50
Activity Spreadsheet -- Enzyme Inhibition Constant Data from BindingDB
Found 2 hits for monomerid = 30364
Trg + Lig
Ki
nM
ΔG°
kcal/mole
IC50
nM
Kd
nM
EC50/IC50
nM
koff
s-1
kon
M-1s-1
pHTemp
°C
Interstitial collagenase
(Homo sapiens (Human))
BDBM30364
(piperidinyl glycine derivative, 24a)
Show SMILES CC(C)OC(=O)N1CCC(CC1)[C@@H](NS(=O)(=O)c1ccc(s1)-c1ccc(cc1)N1CCCCC1)C(O)=O |r|
Show InChI InChI=1S/C26H35N3O6S2/c1-18(2)35-26(32)29-16-12-20(13-17-29)24(25(30)31)27-37(33,34)23-11-10-22(36-23)19-6-8-21(9-7-19)28-14-4-3-5-15-28/h6-11,18,20,24,27H,3-5,12-17H2,1-2H3,(H,30,31)/t24-/m1/s1
Reactome pathway
n/an/a>1.00E+4n/an/an/an/an/a25
Novartis
Assay Description
Test compounds were serially diluted in deep well plates, and an aliquot of the inhibitor solutions was transferred to a Biomek deep well plate conta...
J Med Chem 52: 3523-38 (2009)
Article DOI: 10.1021/jm801394m
BindingDB Entry DOI: 10.7270/Q2B27SN3
Collagenase 3
(Homo sapiens (Human))
BDBM30364
(piperidinyl glycine derivative, 24a)
Show SMILES CC(C)OC(=O)N1CCC(CC1)[C@@H](NS(=O)(=O)c1ccc(s1)-c1ccc(cc1)N1CCCCC1)C(O)=O |r|
Show InChI InChI=1S/C26H35N3O6S2/c1-18(2)35-26(32)29-16-12-20(13-17-29)24(25(30)31)27-37(33,34)23-11-10-22(36-23)19-6-8-21(9-7-19)28-14-4-3-5-15-28/h6-11,18,20,24,27H,3-5,12-17H2,1-2H3,(H,30,31)/t24-/m1/s1
NCI pathway
Reactome pathway
n/an/a 1.30n/an/an/an/a7.522
Novartis
Assay Description
Test compounds were serially diluted in the assay buffer. In each well of a 96-well microtiter plate (Immunofluor B, Dynatech), the inhibitor solutio...
J Med Chem 52: 3523-38 (2009)
Article DOI: 10.1021/jm801394m
BindingDB Entry DOI: 10.7270/Q2B27SN3