BDBM30480 1,1-dioxoisothiazole analog., 24
SMILES: CCOc1cccc2C(NS(=O)(=O)c12)=C1C(=O)[C@H](CC(C)C)N(CCC(C)(C)C)C1=O
InChI Key: InChIKey=RPAVDBHNXQFSHI-INIZCTEOSA-N
Data: 1 IC50
Activity Spreadsheet -- Enzyme Inhibition Constant Data from BindingDB
Found 1 hit for monomerid = 30480
Trg + Lig
Ki
nM
ΔG°
kcal/mole
IC50
nM
Kd
nM
EC50/IC50
nM
koff
s-1
kon
M-1s-1
pHTemp
°C
Non-structural protein 5B (NS5B)
(Hepatitis C virus genotype 1b (isolate BK) (HCV))
BDBM30480
(1,1-dioxoisothiazole analog., 24)
Show SMILES CCOc1cccc2C(NS(=O)(=O)c12)=C1C(=O)[C@H](CC(C)C)N(CCC(C)(C)C)C1=O |r,w:14.16|
Show InChI InChI=1S/C23H32N2O5S/c1-7-30-17-10-8-9-15-19(24-31(28,29)21(15)17)18-20(26)16(13-14(2)3)25(22(18)27)12-11-23(4,5)6/h8-10,14,16,24H,7,11-13H2,1-6H3/t16-/m0/s1
n/an/a 5.10E+3n/an/an/an/a7.528
Anadys Pharmaceuticals
Assay Description
Assays were performed in a 96-well streptavidin-coated Flash-Plate using enzyme, RNA substrate, and [alpha-33P]GTP/GTP with inhibitor concentration v...
Bioorg Med Chem Lett 18: 4181-5 (2008)
Article DOI: 10.1016/j.bmcl.2008.05.083
BindingDB Entry DOI: 10.7270/Q2PC30Q5