BDBM3086 2-aminopyrido[2,3-d]pyrimidin-7(8H)-one 53::6-(2,6-dichlorophenyl)-2-[(4-methoxy-3-methylphenyl)amino]-8-methyl-7H,8H-pyrido[2,3-d]pyrimidin-7-one::PD 166285 analog
SMILES: COc1ccc(Nc2ncc3cc(-c4c(Cl)cccc4Cl)c(=O)n(C)c3n2)cc1C
InChI Key: InChIKey=PBDZUUYDHCFPJM-UHFFFAOYSA-N
Data: 4 IC50
Activity Spreadsheet -- Enzyme Inhibition Constant Data from BindingDB
Found 4 hits for monomerid = 3086
Trg + Lig
Ki
nM
ΔG°
kcal/mole
IC50
nM
Kd
nM
EC50/IC50
nM
koff
s-1
kon
M-1s-1
pHTemp
°C
Platelet-derived growth factor receptor beta
(Homo sapiens (Human))
BDBM3086
(2-aminopyrido[2,3-d]pyrimidin-7(8H)-one 53 | 6-(2,...)
Show SMILES COc1ccc(Nc2ncc3cc(-c4c(Cl)cccc4Cl)c(=O)n(C)c3n2)cc1C |(-7.06,-7.68,;-8.15,-6.59,;-8.15,-5.05,;-6.82,-4.28,;-6.82,-2.74,;-8.15,-1.97,;-8.15,-.43,;-6.82,.34,;-6.82,1.88,;-5.48,2.65,;-4.15,1.88,;-2.82,2.65,;-1.48,1.88,;-.15,2.65,;-.15,4.19,;-1.48,4.96,;1.18,4.96,;2.52,4.19,;2.52,2.65,;1.18,1.88,;1.18,.34,;-1.48,.34,;-.15,-.43,;-2.82,-.43,;-2.82,-1.97,;-4.15,.34,;-5.48,-.43,;-9.48,-2.74,;-9.48,-4.28,;-10.82,-5.05,)|
Show InChI InChI=1S/C22H18Cl2N4O2/c1-12-9-14(7-8-18(12)30-3)26-22-25-11-13-10-15(21(29)28(2)20(13)27-22)19-16(23)5-4-6-17(19)24/h4-11H,1-3H3,(H,25,26,27)
NCI pathway
Reactome pathway
n/an/a 1.50E+3n/an/an/an/an/an/a
Parke-Davis Pharmaceutical Research
Assay Description
IC50 is the inhibitor concentration which inhibits 50% of kinase activity that catalyzes the transfer of the terminal phosphate from [gamma-32P] labe...
J Med Chem 41: 3276-92 (1998)
Article DOI: 10.1021/jm9802259
BindingDB Entry DOI: 10.7270/Q27P8WK3
Epidermal growth factor receptor
(Homo sapiens (Human))
BDBM3086
(2-aminopyrido[2,3-d]pyrimidin-7(8H)-one 53 | 6-(2,...)
Show SMILES COc1ccc(Nc2ncc3cc(-c4c(Cl)cccc4Cl)c(=O)n(C)c3n2)cc1C |(-7.06,-7.68,;-8.15,-6.59,;-8.15,-5.05,;-6.82,-4.28,;-6.82,-2.74,;-8.15,-1.97,;-8.15,-.43,;-6.82,.34,;-6.82,1.88,;-5.48,2.65,;-4.15,1.88,;-2.82,2.65,;-1.48,1.88,;-.15,2.65,;-.15,4.19,;-1.48,4.96,;1.18,4.96,;2.52,4.19,;2.52,2.65,;1.18,1.88,;1.18,.34,;-1.48,.34,;-.15,-.43,;-2.82,-.43,;-2.82,-1.97,;-4.15,.34,;-5.48,-.43,;-9.48,-2.74,;-9.48,-4.28,;-10.82,-5.05,)|
Show InChI InChI=1S/C22H18Cl2N4O2/c1-12-9-14(7-8-18(12)30-3)26-22-25-11-13-10-15(21(29)28(2)20(13)27-22)19-16(23)5-4-6-17(19)24/h4-11H,1-3H3,(H,25,26,27)
n/an/a 250n/an/an/an/an/an/a
Parke-Davis Pharmaceutical Research
Assay Description
IC50 is the inhibitor concentration which inhibits 50% of kinase activity that catalyzes the transfer of the terminal phosphate from [gamma-32P] labe...
J Med Chem 41: 3276-92 (1998)
Article DOI: 10.1021/jm9802259
BindingDB Entry DOI: 10.7270/Q27P8WK3
Proto-oncogene tyrosine-protein kinase Src
(Homo sapiens (Human))
BDBM3086
(2-aminopyrido[2,3-d]pyrimidin-7(8H)-one 53 | 6-(2,...)
Show SMILES COc1ccc(Nc2ncc3cc(-c4c(Cl)cccc4Cl)c(=O)n(C)c3n2)cc1C |(-7.06,-7.68,;-8.15,-6.59,;-8.15,-5.05,;-6.82,-4.28,;-6.82,-2.74,;-8.15,-1.97,;-8.15,-.43,;-6.82,.34,;-6.82,1.88,;-5.48,2.65,;-4.15,1.88,;-2.82,2.65,;-1.48,1.88,;-.15,2.65,;-.15,4.19,;-1.48,4.96,;1.18,4.96,;2.52,4.19,;2.52,2.65,;1.18,1.88,;1.18,.34,;-1.48,.34,;-.15,-.43,;-2.82,-.43,;-2.82,-1.97,;-4.15,.34,;-5.48,-.43,;-9.48,-2.74,;-9.48,-4.28,;-10.82,-5.05,)|
Show InChI InChI=1S/C22H18Cl2N4O2/c1-12-9-14(7-8-18(12)30-3)26-22-25-11-13-10-15(21(29)28(2)20(13)27-22)19-16(23)5-4-6-17(19)24/h4-11H,1-3H3,(H,25,26,27)
n/an/a 50n/an/an/an/an/an/a
Parke-Davis Pharmaceutical Research
Assay Description
IC50 is the inhibitor concentration which inhibits 50% of kinase activity that catalyzes the transfer of the terminal phosphate from [gamma-32P] labe...
J Med Chem 41: 3276-92 (1998)
Article DOI: 10.1021/jm9802259
BindingDB Entry DOI: 10.7270/Q27P8WK3
Fibroblast growth factor receptor 1
(Homo sapiens (Human))
BDBM3086
(2-aminopyrido[2,3-d]pyrimidin-7(8H)-one 53 | 6-(2,...)
Show SMILES COc1ccc(Nc2ncc3cc(-c4c(Cl)cccc4Cl)c(=O)n(C)c3n2)cc1C |(-7.06,-7.68,;-8.15,-6.59,;-8.15,-5.05,;-6.82,-4.28,;-6.82,-2.74,;-8.15,-1.97,;-8.15,-.43,;-6.82,.34,;-6.82,1.88,;-5.48,2.65,;-4.15,1.88,;-2.82,2.65,;-1.48,1.88,;-.15,2.65,;-.15,4.19,;-1.48,4.96,;1.18,4.96,;2.52,4.19,;2.52,2.65,;1.18,1.88,;1.18,.34,;-1.48,.34,;-.15,-.43,;-2.82,-.43,;-2.82,-1.97,;-4.15,.34,;-5.48,-.43,;-9.48,-2.74,;-9.48,-4.28,;-10.82,-5.05,)|
Show InChI InChI=1S/C22H18Cl2N4O2/c1-12-9-14(7-8-18(12)30-3)26-22-25-11-13-10-15(21(29)28(2)20(13)27-22)19-16(23)5-4-6-17(19)24/h4-11H,1-3H3,(H,25,26,27)
NCI pathway
Reactome pathway
n/an/a 450n/an/an/an/an/an/a
Parke-Davis Pharmaceutical Research
Assay Description
IC50 is the inhibitor concentration which inhibits 50% of kinase activity that catalyzes the transfer of the terminal phosphate from [gamma-32P] labe...
J Med Chem 41: 3276-92 (1998)
Article DOI: 10.1021/jm9802259
BindingDB Entry DOI: 10.7270/Q27P8WK3