BDBM310722 8-((5-Fluoropyridin-2-yl)(1-methyl-1H-pyrazol-3-yl)amino)-N-hydroxyoctanamide::US10150763, Example V
SMILES: Cn1ccc(n1)N(CCCCCCCC(=O)NO)c1ccc(F)cn1
InChI Key: InChIKey=VVJMWYSXFPSSLA-UHFFFAOYSA-N
Data: 2 IC50
Activity Spreadsheet -- Enzyme Inhibition Constant Data from BindingDB
Found 2 hits for monomerid = 310722
Trg + Lig
Ki
nM
ΔG°
kcal/mole
IC50
nM
Kd
nM
EC50/IC50
nM
koff
s-1
kon
M-1s-1
pHTemp
°C
Histone deacetylase 6
(Homo sapiens (Human))
BDBM310722
(8-((5-Fluoropyridin-2-yl)(1-methyl-1H-pyrazol-3-yl...)
Show SMILES Cn1ccc(n1)N(CCCCCCCC(=O)NO)c1ccc(F)cn1
Show InChI InChI=1S/C17H24FN5O2/c1-22-12-10-16(20-22)23(15-9-8-14(18)13-19-15)11-6-4-2-3-5-7-17(24)21-25/h8-10,12-13,25H,2-7,11H2,1H3,(H,21,24)
NCI pathway
Reactome pathway
US Patent
n/an/a<500n/an/an/an/an/an/a
Karus Therapeutics Limited
US Patent
Assay Description
The assay is described in WO2008/062201.
US Patent US10150763 (2018)
BindingDB Entry DOI: 10.7270/Q2C82CC1
Histone deacetylase 1
(Homo sapiens (Human))
BDBM310722
(8-((5-Fluoropyridin-2-yl)(1-methyl-1H-pyrazol-3-yl...)
Show SMILES Cn1ccc(n1)N(CCCCCCCC(=O)NO)c1ccc(F)cn1
Show InChI InChI=1S/C17H24FN5O2/c1-22-12-10-16(20-22)23(15-9-8-14(18)13-19-15)11-6-4-2-3-5-7-17(24)21-25/h8-10,12-13,25H,2-7,11H2,1H3,(H,21,24)
NCI pathway
Reactome pathway
US Patent
n/an/a>1.00E+4n/an/an/an/an/an/a
Karus Therapeutics Limited
US Patent
Assay Description
The assay is described in WO2008/062201.
US Patent US10150763 (2018)
BindingDB Entry DOI: 10.7270/Q2C82CC1