null
SMILES: CN1CCN(CC1)c1cc(Nc2cc(C)n[nH]2)nc(Sc2ccc(NC(=O)C3CC3)cc2)n1
InChI Key: InChIKey=GCIKSSRWRFVXBI-UHFFFAOYSA-N
PDB links: 11 PDB IDs match this monomer.
Activity Spreadsheet -- Enzyme Inhibition Constant Data from BindingDB
Found 1026 hits for monomerid = 13534
Trg + Lig
Ki
nM
ΔG°
kcal/mole
IC50
nM
Kd
nM
EC50/IC50
nM
koff
s-1
kon
M-1s-1
pHTemp
°C
Cyclin-dependent kinase 5
(Homo sapiens (Human))
BDBM13534
(CHEMBL572878 | N-[4-({4-[(3-methyl-1H-pyrazol-5-yl...)
Show SMILES CN1CCN(CC1)c1cc(Nc2cc(C)n[nH]2)nc(Sc2ccc(NC(=O)C3CC3)cc2)n1
Show InChI InChI=1S/C23H28N8OS/c1-15-13-20(29-28-15)25-19-14-21(31-11-9-30(2)10-12-31)27-23(26-19)33-18-7-5-17(6-8-18)24-22(32)16-3-4-16/h5-8,13-14,16H,3-4,9-12H2,1-2H3,(H,24,32)(H2,25,26,27,28,29)
NCI pathway
Reactome pathway
n/an/an/a>1.00E+4n/an/an/an/an/a
Ambit Biosciences
Curated by ChEMBL
Assay Description
Binding constant for full-length CDK5
Nat Biotechnol 26: 127-32 (2008)
Article DOI: 10.1038/nbt1358
BindingDB Entry DOI: 10.7270/Q2TT4RX2
Serine/threonine-protein kinase MRCK beta
(Homo sapiens (Human))
BDBM13534
(CHEMBL572878 | N-[4-({4-[(3-methyl-1H-pyrazol-5-yl...)
Show SMILES CN1CCN(CC1)c1cc(Nc2cc(C)n[nH]2)nc(Sc2ccc(NC(=O)C3CC3)cc2)n1
Show InChI InChI=1S/C23H28N8OS/c1-15-13-20(29-28-15)25-19-14-21(31-11-9-30(2)10-12-31)27-23(26-19)33-18-7-5-17(6-8-18)24-22(32)16-3-4-16/h5-8,13-14,16H,3-4,9-12H2,1-2H3,(H,24,32)(H2,25,26,27,28,29)
n/an/an/a>1.00E+4n/an/an/an/an/a
Ambit Biosciences
Curated by ChEMBL
Assay Description
Binding constant for MRCKB kinase domain
Nat Biotechnol 26: 127-32 (2008)
Article DOI: 10.1038/nbt1358
BindingDB Entry DOI: 10.7270/Q2TT4RX2
Serine/threonine-protein kinase PAK 4
(Homo sapiens (Human))
BDBM13534
(CHEMBL572878 | N-[4-({4-[(3-methyl-1H-pyrazol-5-yl...)
Show SMILES CN1CCN(CC1)c1cc(Nc2cc(C)n[nH]2)nc(Sc2ccc(NC(=O)C3CC3)cc2)n1
Show InChI InChI=1S/C23H28N8OS/c1-15-13-20(29-28-15)25-19-14-21(31-11-9-30(2)10-12-31)27-23(26-19)33-18-7-5-17(6-8-18)24-22(32)16-3-4-16/h5-8,13-14,16H,3-4,9-12H2,1-2H3,(H,24,32)(H2,25,26,27,28,29)
Reactome pathway
n/an/an/a 4.30E+3n/an/an/an/an/a
Ambit Biosciences
Curated by ChEMBL
Assay Description
Binding constant for PAK4 kinase domain
Nat Biotechnol 26: 127-32 (2008)
Article DOI: 10.1038/nbt1358
BindingDB Entry DOI: 10.7270/Q2TT4RX2
Cyclin-dependent kinase 7
(Homo sapiens (Human))
BDBM13534
(CHEMBL572878 | N-[4-({4-[(3-methyl-1H-pyrazol-5-yl...)
Show SMILES CN1CCN(CC1)c1cc(Nc2cc(C)n[nH]2)nc(Sc2ccc(NC(=O)C3CC3)cc2)n1
Show InChI InChI=1S/C23H28N8OS/c1-15-13-20(29-28-15)25-19-14-21(31-11-9-30(2)10-12-31)27-23(26-19)33-18-7-5-17(6-8-18)24-22(32)16-3-4-16/h5-8,13-14,16H,3-4,9-12H2,1-2H3,(H,24,32)(H2,25,26,27,28,29)
NCI pathway
Reactome pathway
n/an/an/a>1.00E+4n/an/an/an/an/a
Ambit Biosciences
Curated by ChEMBL
Assay Description
Binding constant for full-length CDK7
Nat Biotechnol 26: 127-32 (2008)
Article DOI: 10.1038/nbt1358
BindingDB Entry DOI: 10.7270/Q2TT4RX2
Tyrosine-protein kinase ABL1
(Homo sapiens (Human))
BDBM13534
(CHEMBL572878 | N-[4-({4-[(3-methyl-1H-pyrazol-5-yl...)
Show SMILES CN1CCN(CC1)c1cc(Nc2cc(C)n[nH]2)nc(Sc2ccc(NC(=O)C3CC3)cc2)n1
Show InChI InChI=1S/C23H28N8OS/c1-15-13-20(29-28-15)25-19-14-21(31-11-9-30(2)10-12-31)27-23(26-19)33-18-7-5-17(6-8-18)24-22(32)16-3-4-16/h5-8,13-14,16H,3-4,9-12H2,1-2H3,(H,24,32)(H2,25,26,27,28,29)
Reactome pathway
n/an/an/a 9.10n/an/an/an/an/a
Ambit Biosciences
Curated by ChEMBL
Assay Description
Binding constant for ABL1(T315I) kinase domain
Nat Biotechnol 26: 127-32 (2008)
Article DOI: 10.1038/nbt1358
BindingDB Entry DOI: 10.7270/Q2TT4RX2
3D
3D Structure (crystal)
NUAK family SNF1-like kinase 2
(Homo sapiens (Human))
BDBM13534
(CHEMBL572878 | N-[4-({4-[(3-methyl-1H-pyrazol-5-yl...)
Show SMILES CN1CCN(CC1)c1cc(Nc2cc(C)n[nH]2)nc(Sc2ccc(NC(=O)C3CC3)cc2)n1
Show InChI InChI=1S/C23H28N8OS/c1-15-13-20(29-28-15)25-19-14-21(31-11-9-30(2)10-12-31)27-23(26-19)33-18-7-5-17(6-8-18)24-22(32)16-3-4-16/h5-8,13-14,16H,3-4,9-12H2,1-2H3,(H,24,32)(H2,25,26,27,28,29)
n/an/an/a 530n/an/an/an/an/a
Ambit Biosciences
Curated by ChEMBL
Assay Description
Binding constant for SNARK kinase domain
Nat Biotechnol 26: 127-32 (2008)
Article DOI: 10.1038/nbt1358
BindingDB Entry DOI: 10.7270/Q2TT4RX2
Serine/threonine-protein kinase 17B
(Homo sapiens (Human))
BDBM13534
(CHEMBL572878 | N-[4-({4-[(3-methyl-1H-pyrazol-5-yl...)
Show SMILES CN1CCN(CC1)c1cc(Nc2cc(C)n[nH]2)nc(Sc2ccc(NC(=O)C3CC3)cc2)n1
Show InChI InChI=1S/C23H28N8OS/c1-15-13-20(29-28-15)25-19-14-21(31-11-9-30(2)10-12-31)27-23(26-19)33-18-7-5-17(6-8-18)24-22(32)16-3-4-16/h5-8,13-14,16H,3-4,9-12H2,1-2H3,(H,24,32)(H2,25,26,27,28,29)
n/an/an/a>1.00E+4n/an/an/an/an/a
Ambit Biosciences
Curated by ChEMBL
Assay Description
Binding constant for full-length DRAK2
Nat Biotechnol 26: 127-32 (2008)
Article DOI: 10.1038/nbt1358
BindingDB Entry DOI: 10.7270/Q2TT4RX2
Serine/threonine-protein kinase Nek2
(Homo sapiens (Human))
BDBM13534
(CHEMBL572878 | N-[4-({4-[(3-methyl-1H-pyrazol-5-yl...)
Show SMILES CN1CCN(CC1)c1cc(Nc2cc(C)n[nH]2)nc(Sc2ccc(NC(=O)C3CC3)cc2)n1
Show InChI InChI=1S/C23H28N8OS/c1-15-13-20(29-28-15)25-19-14-21(31-11-9-30(2)10-12-31)27-23(26-19)33-18-7-5-17(6-8-18)24-22(32)16-3-4-16/h5-8,13-14,16H,3-4,9-12H2,1-2H3,(H,24,32)(H2,25,26,27,28,29)
n/an/an/a>1.00E+4n/an/an/an/an/a
Ambit Biosciences
Curated by ChEMBL
Assay Description
Binding constant for NEK2 kinase domain
Nat Biotechnol 26: 127-32 (2008)
Article DOI: 10.1038/nbt1358
BindingDB Entry DOI: 10.7270/Q2TT4RX2
Ribosomal protein S6 kinase alpha-4
(Homo sapiens (Human))
BDBM13534
(CHEMBL572878 | N-[4-({4-[(3-methyl-1H-pyrazol-5-yl...)
Show SMILES CN1CCN(CC1)c1cc(Nc2cc(C)n[nH]2)nc(Sc2ccc(NC(=O)C3CC3)cc2)n1
Show InChI InChI=1S/C23H28N8OS/c1-15-13-20(29-28-15)25-19-14-21(31-11-9-30(2)10-12-31)27-23(26-19)33-18-7-5-17(6-8-18)24-22(32)16-3-4-16/h5-8,13-14,16H,3-4,9-12H2,1-2H3,(H,24,32)(H2,25,26,27,28,29)
NCI pathway
Reactome pathway
n/an/an/a>1.00E+4n/an/an/an/an/a
Ambit Biosciences
Curated by ChEMBL
Assay Description
Binding constant for RPS6KA4(Kin.Dom.1 - C-terminal) kinase domain
Nat Biotechnol 26: 127-32 (2008)
Article DOI: 10.1038/nbt1358
BindingDB Entry DOI: 10.7270/Q2TT4RX2
Aurora kinase C
(Homo sapiens (Human))
BDBM13534
(CHEMBL572878 | N-[4-({4-[(3-methyl-1H-pyrazol-5-yl...)
Show SMILES CN1CCN(CC1)c1cc(Nc2cc(C)n[nH]2)nc(Sc2ccc(NC(=O)C3CC3)cc2)n1
Show InChI InChI=1S/C23H28N8OS/c1-15-13-20(29-28-15)25-19-14-21(31-11-9-30(2)10-12-31)27-23(26-19)33-18-7-5-17(6-8-18)24-22(32)16-3-4-16/h5-8,13-14,16H,3-4,9-12H2,1-2H3,(H,24,32)(H2,25,26,27,28,29)
NCI pathway
n/an/a 70n/an/an/an/an/an/a
University of Dundee
Curated by ChEMBL
Assay Description
Inhibition of Aurora C in the presence of 100uM ATP
Biochem J 408: 297-315 (2007)
Article DOI: 10.1042/BJ20070797
BindingDB Entry DOI: 10.7270/Q27082B4
3D
3D Structure (crystal)
Maternal embryonic leucine zipper kinase
(Homo sapiens (Human))
BDBM13534
(CHEMBL572878 | N-[4-({4-[(3-methyl-1H-pyrazol-5-yl...)
Show SMILES CN1CCN(CC1)c1cc(Nc2cc(C)n[nH]2)nc(Sc2ccc(NC(=O)C3CC3)cc2)n1
Show InChI InChI=1S/C23H28N8OS/c1-15-13-20(29-28-15)25-19-14-21(31-11-9-30(2)10-12-31)27-23(26-19)33-18-7-5-17(6-8-18)24-22(32)16-3-4-16/h5-8,13-14,16H,3-4,9-12H2,1-2H3,(H,24,32)(H2,25,26,27,28,29)
n/an/a 420n/an/an/an/an/an/a
University of Dundee
Curated by ChEMBL
Assay Description
Inhibition of MELK in the presence of 50uM ATP
Biochem J 408: 297-315 (2007)
Article DOI: 10.1042/BJ20070797
BindingDB Entry DOI: 10.7270/Q27082B4
Proto-oncogene tyrosine-protein kinase Src
(Gallus gallus (Chicken))
BDBM13534
(CHEMBL572878 | N-[4-({4-[(3-methyl-1H-pyrazol-5-yl...)
Show SMILES CN1CCN(CC1)c1cc(Nc2cc(C)n[nH]2)nc(Sc2ccc(NC(=O)C3CC3)cc2)n1
Show InChI InChI=1S/C23H28N8OS/c1-15-13-20(29-28-15)25-19-14-21(31-11-9-30(2)10-12-31)27-23(26-19)33-18-7-5-17(6-8-18)24-22(32)16-3-4-16/h5-8,13-14,16H,3-4,9-12H2,1-2H3,(H,24,32)(H2,25,26,27,28,29)
n/an/a 340n/an/an/an/an/an/a
University of Dundee
Curated by ChEMBL
Assay Description
Inhibition of Src in the presence of 50uM ATP
Biochem J 408: 297-315 (2007)
Article DOI: 10.1042/BJ20070797
BindingDB Entry DOI: 10.7270/Q27082B4
Calcium/calmodulin-dependent protein kinase type 1G
(Homo sapiens (Human))
BDBM13534
(CHEMBL572878 | N-[4-({4-[(3-methyl-1H-pyrazol-5-yl...)
Show SMILES CN1CCN(CC1)c1cc(Nc2cc(C)n[nH]2)nc(Sc2ccc(NC(=O)C3CC3)cc2)n1
Show InChI InChI=1S/C23H28N8OS/c1-15-13-20(29-28-15)25-19-14-21(31-11-9-30(2)10-12-31)27-23(26-19)33-18-7-5-17(6-8-18)24-22(32)16-3-4-16/h5-8,13-14,16H,3-4,9-12H2,1-2H3,(H,24,32)(H2,25,26,27,28,29)
n/an/an/a>1.00E+4n/an/an/an/an/a
Ambit Biosciences
Curated by ChEMBL
Assay Description
Binding constant for CAMK1G kinase domain
Nat Biotechnol 26: 127-32 (2008)
Article DOI: 10.1038/nbt1358
BindingDB Entry DOI: 10.7270/Q2TT4RX2
Calcium/calmodulin-dependent protein kinase type II subunit alpha
(Homo sapiens (Human))
BDBM13534
(CHEMBL572878 | N-[4-({4-[(3-methyl-1H-pyrazol-5-yl...)
Show SMILES CN1CCN(CC1)c1cc(Nc2cc(C)n[nH]2)nc(Sc2ccc(NC(=O)C3CC3)cc2)n1
Show InChI InChI=1S/C23H28N8OS/c1-15-13-20(29-28-15)25-19-14-21(31-11-9-30(2)10-12-31)27-23(26-19)33-18-7-5-17(6-8-18)24-22(32)16-3-4-16/h5-8,13-14,16H,3-4,9-12H2,1-2H3,(H,24,32)(H2,25,26,27,28,29)
Reactome pathway
n/an/an/a>1.00E+4n/an/an/an/an/a
Ambit Biosciences
Curated by ChEMBL
Assay Description
Binding constant for CAMK2A kinase domain
Nat Biotechnol 26: 127-32 (2008)
Article DOI: 10.1038/nbt1358
BindingDB Entry DOI: 10.7270/Q2TT4RX2
Serine/threonine-protein kinase MARK2
(Homo sapiens (Human))
BDBM13534
(CHEMBL572878 | N-[4-({4-[(3-methyl-1H-pyrazol-5-yl...)
Show SMILES CN1CCN(CC1)c1cc(Nc2cc(C)n[nH]2)nc(Sc2ccc(NC(=O)C3CC3)cc2)n1
Show InChI InChI=1S/C23H28N8OS/c1-15-13-20(29-28-15)25-19-14-21(31-11-9-30(2)10-12-31)27-23(26-19)33-18-7-5-17(6-8-18)24-22(32)16-3-4-16/h5-8,13-14,16H,3-4,9-12H2,1-2H3,(H,24,32)(H2,25,26,27,28,29)
NCI pathway
n/an/an/a 1.40E+3n/an/an/an/an/a
Ambit Biosciences
Curated by ChEMBL
Assay Description
Binding constant for MARK2 kinase domain
Nat Biotechnol 26: 127-32 (2008)
Article DOI: 10.1038/nbt1358
BindingDB Entry DOI: 10.7270/Q2TT4RX2
Mitogen-activated protein kinase kinase kinase kinase 5
(Homo sapiens (Human))
BDBM13534
(CHEMBL572878 | N-[4-({4-[(3-methyl-1H-pyrazol-5-yl...)
Show SMILES CN1CCN(CC1)c1cc(Nc2cc(C)n[nH]2)nc(Sc2ccc(NC(=O)C3CC3)cc2)n1
Show InChI InChI=1S/C23H28N8OS/c1-15-13-20(29-28-15)25-19-14-21(31-11-9-30(2)10-12-31)27-23(26-19)33-18-7-5-17(6-8-18)24-22(32)16-3-4-16/h5-8,13-14,16H,3-4,9-12H2,1-2H3,(H,24,32)(H2,25,26,27,28,29)
NCI pathway
n/an/an/a 83n/an/an/an/an/a
Ambit Biosciences
Curated by ChEMBL
Assay Description
Binding constant for MAP4K5 kinase domain
Nat Biotechnol 26: 127-32 (2008)
Article DOI: 10.1038/nbt1358
BindingDB Entry DOI: 10.7270/Q2TT4RX2
MAP kinase-interacting serine/threonine-protein kinase 1
(Homo sapiens (Human))
BDBM13534
(CHEMBL572878 | N-[4-({4-[(3-methyl-1H-pyrazol-5-yl...)
Show SMILES CN1CCN(CC1)c1cc(Nc2cc(C)n[nH]2)nc(Sc2ccc(NC(=O)C3CC3)cc2)n1
Show InChI InChI=1S/C23H28N8OS/c1-15-13-20(29-28-15)25-19-14-21(31-11-9-30(2)10-12-31)27-23(26-19)33-18-7-5-17(6-8-18)24-22(32)16-3-4-16/h5-8,13-14,16H,3-4,9-12H2,1-2H3,(H,24,32)(H2,25,26,27,28,29)
NCI pathway
Reactome pathway
n/an/an/a>1.00E+4n/an/an/an/an/a
Ambit Biosciences
Curated by ChEMBL
Assay Description
Binding constant for full-length MKNK1
Nat Biotechnol 26: 127-32 (2008)
Article DOI: 10.1038/nbt1358
BindingDB Entry DOI: 10.7270/Q2TT4RX2
Serine/threonine-protein kinase LATS2
(Homo sapiens (Human))
BDBM13534
(CHEMBL572878 | N-[4-({4-[(3-methyl-1H-pyrazol-5-yl...)
Show SMILES CN1CCN(CC1)c1cc(Nc2cc(C)n[nH]2)nc(Sc2ccc(NC(=O)C3CC3)cc2)n1
Show InChI InChI=1S/C23H28N8OS/c1-15-13-20(29-28-15)25-19-14-21(31-11-9-30(2)10-12-31)27-23(26-19)33-18-7-5-17(6-8-18)24-22(32)16-3-4-16/h5-8,13-14,16H,3-4,9-12H2,1-2H3,(H,24,32)(H2,25,26,27,28,29)
NCI pathway
Reactome pathway
n/an/an/a>1.00E+4n/an/an/an/an/a
Ambit Biosciences
Curated by ChEMBL
Assay Description
Binding constant for LATS2 kinase domain
Nat Biotechnol 26: 127-32 (2008)
Article DOI: 10.1038/nbt1358
BindingDB Entry DOI: 10.7270/Q2TT4RX2
Tyrosine-protein kinase ITK/TSK
(Homo sapiens (Human))
BDBM13534
(CHEMBL572878 | N-[4-({4-[(3-methyl-1H-pyrazol-5-yl...)
Show SMILES CN1CCN(CC1)c1cc(Nc2cc(C)n[nH]2)nc(Sc2ccc(NC(=O)C3CC3)cc2)n1
Show InChI InChI=1S/C23H28N8OS/c1-15-13-20(29-28-15)25-19-14-21(31-11-9-30(2)10-12-31)27-23(26-19)33-18-7-5-17(6-8-18)24-22(32)16-3-4-16/h5-8,13-14,16H,3-4,9-12H2,1-2H3,(H,24,32)(H2,25,26,27,28,29)
Reactome pathway
n/an/an/a 350n/an/an/an/an/a
Ambit Biosciences
Curated by ChEMBL
Assay Description
Binding constant for ITK kinase domain
Nat Biotechnol 26: 127-32 (2008)
Article DOI: 10.1038/nbt1358
BindingDB Entry DOI: 10.7270/Q2TT4RX2
Phosphatidylinositol 4,5-bisphosphate 3-kinase catalytic subunit alpha isoform
(Homo sapiens (Human))
BDBM13534
(CHEMBL572878 | N-[4-({4-[(3-methyl-1H-pyrazol-5-yl...)
Show SMILES CN1CCN(CC1)c1cc(Nc2cc(C)n[nH]2)nc(Sc2ccc(NC(=O)C3CC3)cc2)n1
Show InChI InChI=1S/C23H28N8OS/c1-15-13-20(29-28-15)25-19-14-21(31-11-9-30(2)10-12-31)27-23(26-19)33-18-7-5-17(6-8-18)24-22(32)16-3-4-16/h5-8,13-14,16H,3-4,9-12H2,1-2H3,(H,24,32)(H2,25,26,27,28,29)
NCI pathway
Reactome pathway
n/an/an/a>1.00E+4n/an/an/an/an/a
Ambit Biosciences
Curated by ChEMBL
Assay Description
Binding constant for PIK3CA kinase domain
Nat Biotechnol 26: 127-32 (2008)
Article DOI: 10.1038/nbt1358
BindingDB Entry DOI: 10.7270/Q2TT4RX2
Serine/threonine-protein kinase SIK1
(Homo sapiens (Human))
BDBM13534
(CHEMBL572878 | N-[4-({4-[(3-methyl-1H-pyrazol-5-yl...)
Show SMILES CN1CCN(CC1)c1cc(Nc2cc(C)n[nH]2)nc(Sc2ccc(NC(=O)C3CC3)cc2)n1
Show InChI InChI=1S/C23H28N8OS/c1-15-13-20(29-28-15)25-19-14-21(31-11-9-30(2)10-12-31)27-23(26-19)33-18-7-5-17(6-8-18)24-22(32)16-3-4-16/h5-8,13-14,16H,3-4,9-12H2,1-2H3,(H,24,32)(H2,25,26,27,28,29)
NCI pathway
n/an/an/a 2.50E+3n/an/an/an/an/a
Ambit Biosciences
Curated by ChEMBL
Assay Description
Binding constant for SNF1LK kinase domain
Nat Biotechnol 26: 127-32 (2008)
Article DOI: 10.1038/nbt1358
BindingDB Entry DOI: 10.7270/Q2TT4RX2
Proto-oncogene tyrosine-protein kinase Src
(Homo sapiens (Human))
BDBM13534
(CHEMBL572878 | N-[4-({4-[(3-methyl-1H-pyrazol-5-yl...)
Show SMILES CN1CCN(CC1)c1cc(Nc2cc(C)n[nH]2)nc(Sc2ccc(NC(=O)C3CC3)cc2)n1
Show InChI InChI=1S/C23H28N8OS/c1-15-13-20(29-28-15)25-19-14-21(31-11-9-30(2)10-12-31)27-23(26-19)33-18-7-5-17(6-8-18)24-22(32)16-3-4-16/h5-8,13-14,16H,3-4,9-12H2,1-2H3,(H,24,32)(H2,25,26,27,28,29)
n/an/an/a 170n/an/an/an/an/a
Ambit Biosciences
Curated by ChEMBL
Assay Description
Binding constant for SRC kinase domain
Nat Biotechnol 26: 127-32 (2008)
Article DOI: 10.1038/nbt1358
BindingDB Entry DOI: 10.7270/Q2TT4RX2
Mitogen-activated protein kinase kinase kinase 4
(Homo sapiens (Human))
BDBM13534
(CHEMBL572878 | N-[4-({4-[(3-methyl-1H-pyrazol-5-yl...)
Show SMILES CN1CCN(CC1)c1cc(Nc2cc(C)n[nH]2)nc(Sc2ccc(NC(=O)C3CC3)cc2)n1
Show InChI InChI=1S/C23H28N8OS/c1-15-13-20(29-28-15)25-19-14-21(31-11-9-30(2)10-12-31)27-23(26-19)33-18-7-5-17(6-8-18)24-22(32)16-3-4-16/h5-8,13-14,16H,3-4,9-12H2,1-2H3,(H,24,32)(H2,25,26,27,28,29)
n/an/an/a 2.50E+3n/an/an/an/an/a
Ambit Biosciences
Curated by ChEMBL
Assay Description
Binding constant for MAP3K4 kinase domain
Nat Biotechnol 26: 127-32 (2008)
Article DOI: 10.1038/nbt1358
BindingDB Entry DOI: 10.7270/Q2TT4RX2
Ephrin type-A receptor 6
(Homo sapiens (Human))
BDBM13534
(CHEMBL572878 | N-[4-({4-[(3-methyl-1H-pyrazol-5-yl...)
Show SMILES CN1CCN(CC1)c1cc(Nc2cc(C)n[nH]2)nc(Sc2ccc(NC(=O)C3CC3)cc2)n1
Show InChI InChI=1S/C23H28N8OS/c1-15-13-20(29-28-15)25-19-14-21(31-11-9-30(2)10-12-31)27-23(26-19)33-18-7-5-17(6-8-18)24-22(32)16-3-4-16/h5-8,13-14,16H,3-4,9-12H2,1-2H3,(H,24,32)(H2,25,26,27,28,29)
NCI pathway
Reactome pathway
n/an/an/a>1.00E+4n/an/an/an/an/a
Ambit Biosciences
Curated by ChEMBL
Assay Description
Binding constant for EPHA6 kinase domain
Nat Biotechnol 26: 127-32 (2008)
Article DOI: 10.1038/nbt1358
BindingDB Entry DOI: 10.7270/Q2TT4RX2
Ephrin type-A receptor 6
(Homo sapiens (Human))
BDBM13534
(CHEMBL572878 | N-[4-({4-[(3-methyl-1H-pyrazol-5-yl...)
Show SMILES CN1CCN(CC1)c1cc(Nc2cc(C)n[nH]2)nc(Sc2ccc(NC(=O)C3CC3)cc2)n1
Show InChI InChI=1S/C23H28N8OS/c1-15-13-20(29-28-15)25-19-14-21(31-11-9-30(2)10-12-31)27-23(26-19)33-18-7-5-17(6-8-18)24-22(32)16-3-4-16/h5-8,13-14,16H,3-4,9-12H2,1-2H3,(H,24,32)(H2,25,26,27,28,29)
NCI pathway
Reactome pathway
n/an/an/a>1.00E+4n/an/an/an/an/a
Ambit Biosciences
Curated by ChEMBL
Assay Description
Binding constant for EPHA7 kinase domain
Nat Biotechnol 26: 127-32 (2008)
Article DOI: 10.1038/nbt1358
BindingDB Entry DOI: 10.7270/Q2TT4RX2
Calcium/calmodulin-dependent protein kinase kinase 2
(Homo sapiens (Human))
BDBM13534
(CHEMBL572878 | N-[4-({4-[(3-methyl-1H-pyrazol-5-yl...)
Show SMILES CN1CCN(CC1)c1cc(Nc2cc(C)n[nH]2)nc(Sc2ccc(NC(=O)C3CC3)cc2)n1
Show InChI InChI=1S/C23H28N8OS/c1-15-13-20(29-28-15)25-19-14-21(31-11-9-30(2)10-12-31)27-23(26-19)33-18-7-5-17(6-8-18)24-22(32)16-3-4-16/h5-8,13-14,16H,3-4,9-12H2,1-2H3,(H,24,32)(H2,25,26,27,28,29)
n/an/an/a>1.00E+4n/an/an/an/an/a
Ambit Biosciences
Curated by ChEMBL
Assay Description
Binding constant for CAMKK2 kinase domain
Nat Biotechnol 26: 127-32 (2008)
Article DOI: 10.1038/nbt1358
BindingDB Entry DOI: 10.7270/Q2TT4RX2
Citron Rho-interacting kinase
(Homo sapiens (Human))
BDBM13534
(CHEMBL572878 | N-[4-({4-[(3-methyl-1H-pyrazol-5-yl...)
Show SMILES CN1CCN(CC1)c1cc(Nc2cc(C)n[nH]2)nc(Sc2ccc(NC(=O)C3CC3)cc2)n1
Show InChI InChI=1S/C23H28N8OS/c1-15-13-20(29-28-15)25-19-14-21(31-11-9-30(2)10-12-31)27-23(26-19)33-18-7-5-17(6-8-18)24-22(32)16-3-4-16/h5-8,13-14,16H,3-4,9-12H2,1-2H3,(H,24,32)(H2,25,26,27,28,29)
n/an/an/a>1.00E+4n/an/an/an/an/a
Ambit Biosciences
Curated by ChEMBL
Assay Description
Binding constant for CIT kinase domain
Nat Biotechnol 26: 127-32 (2008)
Article DOI: 10.1038/nbt1358
BindingDB Entry DOI: 10.7270/Q2TT4RX2
Protein kinase C theta type
(Homo sapiens (Human))
BDBM13534
(CHEMBL572878 | N-[4-({4-[(3-methyl-1H-pyrazol-5-yl...)
Show SMILES CN1CCN(CC1)c1cc(Nc2cc(C)n[nH]2)nc(Sc2ccc(NC(=O)C3CC3)cc2)n1
Show InChI InChI=1S/C23H28N8OS/c1-15-13-20(29-28-15)25-19-14-21(31-11-9-30(2)10-12-31)27-23(26-19)33-18-7-5-17(6-8-18)24-22(32)16-3-4-16/h5-8,13-14,16H,3-4,9-12H2,1-2H3,(H,24,32)(H2,25,26,27,28,29)
NCI pathway
Reactome pathway
n/an/an/a>1.00E+4n/an/an/an/an/a
Ambit Biosciences
Curated by ChEMBL
Assay Description
Binding constant for PRKCQ kinase domain
Nat Biotechnol 26: 127-32 (2008)
Article DOI: 10.1038/nbt1358
BindingDB Entry DOI: 10.7270/Q2TT4RX2
Leukocyte tyrosine kinase receptor
(Homo sapiens (Human))
BDBM13534
(CHEMBL572878 | N-[4-({4-[(3-methyl-1H-pyrazol-5-yl...)
Show SMILES CN1CCN(CC1)c1cc(Nc2cc(C)n[nH]2)nc(Sc2ccc(NC(=O)C3CC3)cc2)n1
Show InChI InChI=1S/C23H28N8OS/c1-15-13-20(29-28-15)25-19-14-21(31-11-9-30(2)10-12-31)27-23(26-19)33-18-7-5-17(6-8-18)24-22(32)16-3-4-16/h5-8,13-14,16H,3-4,9-12H2,1-2H3,(H,24,32)(H2,25,26,27,28,29)
n/an/an/a 7.50E+3n/an/an/an/an/a
Ambit Biosciences
Curated by ChEMBL
Assay Description
Binding constant for LTK kinase domain
Nat Biotechnol 26: 127-32 (2008)
Article DOI: 10.1038/nbt1358
BindingDB Entry DOI: 10.7270/Q2TT4RX2
Serine/threonine-protein kinase pim-1
(Homo sapiens (Human))
BDBM13534
(CHEMBL572878 | N-[4-({4-[(3-methyl-1H-pyrazol-5-yl...)
Show SMILES CN1CCN(CC1)c1cc(Nc2cc(C)n[nH]2)nc(Sc2ccc(NC(=O)C3CC3)cc2)n1
Show InChI InChI=1S/C23H28N8OS/c1-15-13-20(29-28-15)25-19-14-21(31-11-9-30(2)10-12-31)27-23(26-19)33-18-7-5-17(6-8-18)24-22(32)16-3-4-16/h5-8,13-14,16H,3-4,9-12H2,1-2H3,(H,24,32)(H2,25,26,27,28,29)
n/an/an/a>1.00E+4n/an/an/an/an/a
Ambit Biosciences
Curated by ChEMBL
Assay Description
Binding constant for PIM1 kinase domain
Nat Biotechnol 26: 127-32 (2008)
Article DOI: 10.1038/nbt1358
BindingDB Entry DOI: 10.7270/Q2TT4RX2
Myosin light chain kinase 2, skeletal/cardiac muscle
(Homo sapiens (Human))
BDBM13534
(CHEMBL572878 | N-[4-({4-[(3-methyl-1H-pyrazol-5-yl...)
Show SMILES CN1CCN(CC1)c1cc(Nc2cc(C)n[nH]2)nc(Sc2ccc(NC(=O)C3CC3)cc2)n1
Show InChI InChI=1S/C23H28N8OS/c1-15-13-20(29-28-15)25-19-14-21(31-11-9-30(2)10-12-31)27-23(26-19)33-18-7-5-17(6-8-18)24-22(32)16-3-4-16/h5-8,13-14,16H,3-4,9-12H2,1-2H3,(H,24,32)(H2,25,26,27,28,29)
n/an/an/a 43n/an/an/an/an/a
Ambit Biosciences
Curated by ChEMBL
Assay Description
Binding constant for MYLK2 kinase domain
Nat Biotechnol 26: 127-32 (2008)
Article DOI: 10.1038/nbt1358
BindingDB Entry DOI: 10.7270/Q2TT4RX2
Myosin-IIIa
(Homo sapiens (Human))
BDBM13534
(CHEMBL572878 | N-[4-({4-[(3-methyl-1H-pyrazol-5-yl...)
Show SMILES CN1CCN(CC1)c1cc(Nc2cc(C)n[nH]2)nc(Sc2ccc(NC(=O)C3CC3)cc2)n1
Show InChI InChI=1S/C23H28N8OS/c1-15-13-20(29-28-15)25-19-14-21(31-11-9-30(2)10-12-31)27-23(26-19)33-18-7-5-17(6-8-18)24-22(32)16-3-4-16/h5-8,13-14,16H,3-4,9-12H2,1-2H3,(H,24,32)(H2,25,26,27,28,29)
n/an/an/a>1.00E+4n/an/an/an/an/a
Ambit Biosciences
Curated by ChEMBL
Assay Description
Binding constant for MYO3A kinase domain
Nat Biotechnol 26: 127-32 (2008)
Article DOI: 10.1038/nbt1358
BindingDB Entry DOI: 10.7270/Q2TT4RX2
Mitogen-activated protein kinase kinase kinase 5
(Homo sapiens (Human))
BDBM13534
(CHEMBL572878 | N-[4-({4-[(3-methyl-1H-pyrazol-5-yl...)
Show SMILES CN1CCN(CC1)c1cc(Nc2cc(C)n[nH]2)nc(Sc2ccc(NC(=O)C3CC3)cc2)n1
Show InChI InChI=1S/C23H28N8OS/c1-15-13-20(29-28-15)25-19-14-21(31-11-9-30(2)10-12-31)27-23(26-19)33-18-7-5-17(6-8-18)24-22(32)16-3-4-16/h5-8,13-14,16H,3-4,9-12H2,1-2H3,(H,24,32)(H2,25,26,27,28,29)
n/an/an/a>1.00E+4n/an/an/an/an/a
Ambit Biosciences
Curated by ChEMBL
Assay Description
Binding constant for MAP3K5 kinase domain
Nat Biotechnol 26: 127-32 (2008)
Article DOI: 10.1038/nbt1358
BindingDB Entry DOI: 10.7270/Q2TT4RX2
Activin receptor type-2A
(Homo sapiens (Human))
BDBM13534
(CHEMBL572878 | N-[4-({4-[(3-methyl-1H-pyrazol-5-yl...)
Show SMILES CN1CCN(CC1)c1cc(Nc2cc(C)n[nH]2)nc(Sc2ccc(NC(=O)C3CC3)cc2)n1
Show InChI InChI=1S/C23H28N8OS/c1-15-13-20(29-28-15)25-19-14-21(31-11-9-30(2)10-12-31)27-23(26-19)33-18-7-5-17(6-8-18)24-22(32)16-3-4-16/h5-8,13-14,16H,3-4,9-12H2,1-2H3,(H,24,32)(H2,25,26,27,28,29)
Reactome pathway
n/an/an/a>1.00E+4n/an/an/an/an/a
Ambit Biosciences
Curated by ChEMBL
Assay Description
Binding constant for ACVR2A kinase domain
Nat Biotechnol 26: 127-32 (2008)
Article DOI: 10.1038/nbt1358
BindingDB Entry DOI: 10.7270/Q2TT4RX2
Mitogen-activated protein kinase 11
(Homo sapiens (Human))
BDBM13534
(CHEMBL572878 | N-[4-({4-[(3-methyl-1H-pyrazol-5-yl...)
Show SMILES CN1CCN(CC1)c1cc(Nc2cc(C)n[nH]2)nc(Sc2ccc(NC(=O)C3CC3)cc2)n1
Show InChI InChI=1S/C23H28N8OS/c1-15-13-20(29-28-15)25-19-14-21(31-11-9-30(2)10-12-31)27-23(26-19)33-18-7-5-17(6-8-18)24-22(32)16-3-4-16/h5-8,13-14,16H,3-4,9-12H2,1-2H3,(H,24,32)(H2,25,26,27,28,29)
Reactome pathway
n/an/an/a>1.00E+4n/an/an/an/an/a
Ambit Biosciences
Curated by ChEMBL
Assay Description
Binding constant for full-length p38-beta
Nat Biotechnol 26: 127-32 (2008)
Article DOI: 10.1038/nbt1358
BindingDB Entry DOI: 10.7270/Q2TT4RX2
Ephrin type-B receptor 1
(Homo sapiens (Human))
BDBM13534
(CHEMBL572878 | N-[4-({4-[(3-methyl-1H-pyrazol-5-yl...)
Show SMILES CN1CCN(CC1)c1cc(Nc2cc(C)n[nH]2)nc(Sc2ccc(NC(=O)C3CC3)cc2)n1
Show InChI InChI=1S/C23H28N8OS/c1-15-13-20(29-28-15)25-19-14-21(31-11-9-30(2)10-12-31)27-23(26-19)33-18-7-5-17(6-8-18)24-22(32)16-3-4-16/h5-8,13-14,16H,3-4,9-12H2,1-2H3,(H,24,32)(H2,25,26,27,28,29)
n/an/an/a 1.90E+3n/an/an/an/an/a
Ambit Biosciences
Curated by ChEMBL
Assay Description
Binding constant for EPHB1 kinase domain
Nat Biotechnol 26: 127-32 (2008)
Article DOI: 10.1038/nbt1358
BindingDB Entry DOI: 10.7270/Q2TT4RX2
Serine/threonine-protein kinase 32B
(Homo sapiens (Human))
BDBM13534
(CHEMBL572878 | N-[4-({4-[(3-methyl-1H-pyrazol-5-yl...)
Show SMILES CN1CCN(CC1)c1cc(Nc2cc(C)n[nH]2)nc(Sc2ccc(NC(=O)C3CC3)cc2)n1
Show InChI InChI=1S/C23H28N8OS/c1-15-13-20(29-28-15)25-19-14-21(31-11-9-30(2)10-12-31)27-23(26-19)33-18-7-5-17(6-8-18)24-22(32)16-3-4-16/h5-8,13-14,16H,3-4,9-12H2,1-2H3,(H,24,32)(H2,25,26,27,28,29)
n/an/an/a>1.00E+4n/an/an/an/an/a
Ambit Biosciences
Curated by ChEMBL
Assay Description
Binding constant for full-length YANK2
Nat Biotechnol 26: 127-32 (2008)
Article DOI: 10.1038/nbt1358
BindingDB Entry DOI: 10.7270/Q2TT4RX2
Tyrosine-protein kinase Fyn
(Homo sapiens (Human))
BDBM13534
(CHEMBL572878 | N-[4-({4-[(3-methyl-1H-pyrazol-5-yl...)
Show SMILES CN1CCN(CC1)c1cc(Nc2cc(C)n[nH]2)nc(Sc2ccc(NC(=O)C3CC3)cc2)n1
Show InChI InChI=1S/C23H28N8OS/c1-15-13-20(29-28-15)25-19-14-21(31-11-9-30(2)10-12-31)27-23(26-19)33-18-7-5-17(6-8-18)24-22(32)16-3-4-16/h5-8,13-14,16H,3-4,9-12H2,1-2H3,(H,24,32)(H2,25,26,27,28,29)
n/an/an/a 530n/an/an/an/an/a
Ambit Biosciences
Curated by ChEMBL
Assay Description
Binding constant for FYN kinase domain
Nat Biotechnol 26: 127-32 (2008)
Article DOI: 10.1038/nbt1358
BindingDB Entry DOI: 10.7270/Q2TT4RX2
Casein kinase II subunit alpha
(Homo sapiens (Human))
BDBM13534
(CHEMBL572878 | N-[4-({4-[(3-methyl-1H-pyrazol-5-yl...)
Show SMILES CN1CCN(CC1)c1cc(Nc2cc(C)n[nH]2)nc(Sc2ccc(NC(=O)C3CC3)cc2)n1
Show InChI InChI=1S/C23H28N8OS/c1-15-13-20(29-28-15)25-19-14-21(31-11-9-30(2)10-12-31)27-23(26-19)33-18-7-5-17(6-8-18)24-22(32)16-3-4-16/h5-8,13-14,16H,3-4,9-12H2,1-2H3,(H,24,32)(H2,25,26,27,28,29)
n/an/an/a 400n/an/an/an/an/a
Ambit Biosciences
Curated by ChEMBL
Assay Description
Binding constant for full-length CSNK2A1
Nat Biotechnol 26: 127-32 (2008)
Article DOI: 10.1038/nbt1358
BindingDB Entry DOI: 10.7270/Q2TT4RX2
Casein kinase II subunit alpha'
(Homo sapiens (Human))
BDBM13534
(CHEMBL572878 | N-[4-({4-[(3-methyl-1H-pyrazol-5-yl...)
Show SMILES CN1CCN(CC1)c1cc(Nc2cc(C)n[nH]2)nc(Sc2ccc(NC(=O)C3CC3)cc2)n1
Show InChI InChI=1S/C23H28N8OS/c1-15-13-20(29-28-15)25-19-14-21(31-11-9-30(2)10-12-31)27-23(26-19)33-18-7-5-17(6-8-18)24-22(32)16-3-4-16/h5-8,13-14,16H,3-4,9-12H2,1-2H3,(H,24,32)(H2,25,26,27,28,29)
Reactome pathway
n/an/an/a 400n/an/an/an/an/a
Ambit Biosciences
Curated by ChEMBL
Assay Description
Binding constant for full-length CSNK2A2
Nat Biotechnol 26: 127-32 (2008)
Article DOI: 10.1038/nbt1358
BindingDB Entry DOI: 10.7270/Q2TT4RX2
Serine/threonine-protein kinase B-raf
(Homo sapiens (Human))
BDBM13534
(CHEMBL572878 | N-[4-({4-[(3-methyl-1H-pyrazol-5-yl...)
Show SMILES CN1CCN(CC1)c1cc(Nc2cc(C)n[nH]2)nc(Sc2ccc(NC(=O)C3CC3)cc2)n1
Show InChI InChI=1S/C23H28N8OS/c1-15-13-20(29-28-15)25-19-14-21(31-11-9-30(2)10-12-31)27-23(26-19)33-18-7-5-17(6-8-18)24-22(32)16-3-4-16/h5-8,13-14,16H,3-4,9-12H2,1-2H3,(H,24,32)(H2,25,26,27,28,29)
NCI pathway
Reactome pathway
n/an/an/a>1.00E+4n/an/an/an/an/a
Ambit Biosciences
Curated by ChEMBL
Assay Description
Binding constant for BRAF kinase domain
Nat Biotechnol 26: 127-32 (2008)
Article DOI: 10.1038/nbt1358
BindingDB Entry DOI: 10.7270/Q2TT4RX2
MAP/microtubule affinity-regulating kinase 3
(Homo sapiens (Human))
BDBM13534
(CHEMBL572878 | N-[4-({4-[(3-methyl-1H-pyrazol-5-yl...)
Show SMILES CN1CCN(CC1)c1cc(Nc2cc(C)n[nH]2)nc(Sc2ccc(NC(=O)C3CC3)cc2)n1
Show InChI InChI=1S/C23H28N8OS/c1-15-13-20(29-28-15)25-19-14-21(31-11-9-30(2)10-12-31)27-23(26-19)33-18-7-5-17(6-8-18)24-22(32)16-3-4-16/h5-8,13-14,16H,3-4,9-12H2,1-2H3,(H,24,32)(H2,25,26,27,28,29)
n/an/an/a 2.50E+3n/an/an/an/an/a
Ambit Biosciences
Curated by ChEMBL
Assay Description
Binding constant for full-length MARK3
Nat Biotechnol 26: 127-32 (2008)
Article DOI: 10.1038/nbt1358
BindingDB Entry DOI: 10.7270/Q2TT4RX2
Mitogen-activated protein kinase 10
(Homo sapiens (Human))
BDBM13534
(CHEMBL572878 | N-[4-({4-[(3-methyl-1H-pyrazol-5-yl...)
Show SMILES CN1CCN(CC1)c1cc(Nc2cc(C)n[nH]2)nc(Sc2ccc(NC(=O)C3CC3)cc2)n1
Show InChI InChI=1S/C23H28N8OS/c1-15-13-20(29-28-15)25-19-14-21(31-11-9-30(2)10-12-31)27-23(26-19)33-18-7-5-17(6-8-18)24-22(32)16-3-4-16/h5-8,13-14,16H,3-4,9-12H2,1-2H3,(H,24,32)(H2,25,26,27,28,29)
NCI pathway
Reactome pathway
n/an/an/a 2.80E+3n/an/an/an/an/a
Ambit Biosciences
Curated by ChEMBL
Assay Description
Binding constant for JNK3 kinase domain
Nat Biotechnol 26: 127-32 (2008)
Article DOI: 10.1038/nbt1358
BindingDB Entry DOI: 10.7270/Q2TT4RX2
Serine/threonine-protein kinase RIO1
(Homo sapiens (Human))
BDBM13534
(CHEMBL572878 | N-[4-({4-[(3-methyl-1H-pyrazol-5-yl...)
Show SMILES CN1CCN(CC1)c1cc(Nc2cc(C)n[nH]2)nc(Sc2ccc(NC(=O)C3CC3)cc2)n1
Show InChI InChI=1S/C23H28N8OS/c1-15-13-20(29-28-15)25-19-14-21(31-11-9-30(2)10-12-31)27-23(26-19)33-18-7-5-17(6-8-18)24-22(32)16-3-4-16/h5-8,13-14,16H,3-4,9-12H2,1-2H3,(H,24,32)(H2,25,26,27,28,29)
n/an/an/a 360n/an/an/an/an/a
Ambit Biosciences
Curated by ChEMBL
Assay Description
Binding constant for full-length RIOK1
Nat Biotechnol 26: 127-32 (2008)
Article DOI: 10.1038/nbt1358
BindingDB Entry DOI: 10.7270/Q2TT4RX2
Calcium/calmodulin-dependent protein kinase type 1
(Homo sapiens (Human))
BDBM13534
(CHEMBL572878 | N-[4-({4-[(3-methyl-1H-pyrazol-5-yl...)
Show SMILES CN1CCN(CC1)c1cc(Nc2cc(C)n[nH]2)nc(Sc2ccc(NC(=O)C3CC3)cc2)n1
Show InChI InChI=1S/C23H28N8OS/c1-15-13-20(29-28-15)25-19-14-21(31-11-9-30(2)10-12-31)27-23(26-19)33-18-7-5-17(6-8-18)24-22(32)16-3-4-16/h5-8,13-14,16H,3-4,9-12H2,1-2H3,(H,24,32)(H2,25,26,27,28,29)
n/an/an/a>1.00E+4n/an/an/an/an/a
Ambit Biosciences
Curated by ChEMBL
Assay Description
Binding constant for full-length CAMK1
Nat Biotechnol 26: 127-32 (2008)
Article DOI: 10.1038/nbt1358
BindingDB Entry DOI: 10.7270/Q2TT4RX2
Cyclin-dependent kinase 2
(Homo sapiens (Human))
BDBM13534
(CHEMBL572878 | N-[4-({4-[(3-methyl-1H-pyrazol-5-yl...)
Show SMILES CN1CCN(CC1)c1cc(Nc2cc(C)n[nH]2)nc(Sc2ccc(NC(=O)C3CC3)cc2)n1
Show InChI InChI=1S/C23H28N8OS/c1-15-13-20(29-28-15)25-19-14-21(31-11-9-30(2)10-12-31)27-23(26-19)33-18-7-5-17(6-8-18)24-22(32)16-3-4-16/h5-8,13-14,16H,3-4,9-12H2,1-2H3,(H,24,32)(H2,25,26,27,28,29)
NCI pathway
Reactome pathway
n/an/an/a>1.00E+4n/an/an/an/an/a
Ambit Biosciences
Curated by ChEMBL
Assay Description
Binding constant for full-length CDK2
Nat Biotechnol 26: 127-32 (2008)
Article DOI: 10.1038/nbt1358
BindingDB Entry DOI: 10.7270/Q2TT4RX2
Cyclin-dependent kinase 3
(Homo sapiens (Human))
BDBM13534
(CHEMBL572878 | N-[4-({4-[(3-methyl-1H-pyrazol-5-yl...)
Show SMILES CN1CCN(CC1)c1cc(Nc2cc(C)n[nH]2)nc(Sc2ccc(NC(=O)C3CC3)cc2)n1
Show InChI InChI=1S/C23H28N8OS/c1-15-13-20(29-28-15)25-19-14-21(31-11-9-30(2)10-12-31)27-23(26-19)33-18-7-5-17(6-8-18)24-22(32)16-3-4-16/h5-8,13-14,16H,3-4,9-12H2,1-2H3,(H,24,32)(H2,25,26,27,28,29)
n/an/an/a>1.00E+4n/an/an/an/an/a
Ambit Biosciences
Curated by ChEMBL
Assay Description
Binding constant for full-length CDK3
Nat Biotechnol 26: 127-32 (2008)
Article DOI: 10.1038/nbt1358
BindingDB Entry DOI: 10.7270/Q2TT4RX2
Serine/threonine-protein kinase STK11
(Homo sapiens (Human))
BDBM13534
(CHEMBL572878 | N-[4-({4-[(3-methyl-1H-pyrazol-5-yl...)
Show SMILES CN1CCN(CC1)c1cc(Nc2cc(C)n[nH]2)nc(Sc2ccc(NC(=O)C3CC3)cc2)n1
Show InChI InChI=1S/C23H28N8OS/c1-15-13-20(29-28-15)25-19-14-21(31-11-9-30(2)10-12-31)27-23(26-19)33-18-7-5-17(6-8-18)24-22(32)16-3-4-16/h5-8,13-14,16H,3-4,9-12H2,1-2H3,(H,24,32)(H2,25,26,27,28,29)
NCI pathway
Reactome pathway
n/an/an/a 1.30E+3n/an/an/an/an/a
Ambit Biosciences
Curated by ChEMBL
Assay Description
Binding constant for full-length LKB1
Nat Biotechnol 26: 127-32 (2008)
Article DOI: 10.1038/nbt1358
BindingDB Entry DOI: 10.7270/Q2TT4RX2
Myosin-IIIb
(Homo sapiens (Human))
BDBM13534
(CHEMBL572878 | N-[4-({4-[(3-methyl-1H-pyrazol-5-yl...)
Show SMILES CN1CCN(CC1)c1cc(Nc2cc(C)n[nH]2)nc(Sc2ccc(NC(=O)C3CC3)cc2)n1
Show InChI InChI=1S/C23H28N8OS/c1-15-13-20(29-28-15)25-19-14-21(31-11-9-30(2)10-12-31)27-23(26-19)33-18-7-5-17(6-8-18)24-22(32)16-3-4-16/h5-8,13-14,16H,3-4,9-12H2,1-2H3,(H,24,32)(H2,25,26,27,28,29)
n/an/an/a>1.00E+4n/an/an/an/an/a
Ambit Biosciences
Curated by ChEMBL
Assay Description
Binding constant for MYO3B kinase domain
Nat Biotechnol 26: 127-32 (2008)
Article DOI: 10.1038/nbt1358
BindingDB Entry DOI: 10.7270/Q2TT4RX2
Insulin receptor-related protein
(Homo sapiens (Human))
BDBM13534
(CHEMBL572878 | N-[4-({4-[(3-methyl-1H-pyrazol-5-yl...)
Show SMILES CN1CCN(CC1)c1cc(Nc2cc(C)n[nH]2)nc(Sc2ccc(NC(=O)C3CC3)cc2)n1
Show InChI InChI=1S/C23H28N8OS/c1-15-13-20(29-28-15)25-19-14-21(31-11-9-30(2)10-12-31)27-23(26-19)33-18-7-5-17(6-8-18)24-22(32)16-3-4-16/h5-8,13-14,16H,3-4,9-12H2,1-2H3,(H,24,32)(H2,25,26,27,28,29)
n/an/an/a 290n/an/an/an/an/a
Ambit Biosciences
Curated by ChEMBL
Assay Description
Binding constant for INSRR kinase domain
Nat Biotechnol 26: 127-32 (2008)
Article DOI: 10.1038/nbt1358
BindingDB Entry DOI: 10.7270/Q2TT4RX2
<<  First   |  Previous   |  Displayed 751 to 800 (of 1026 total )  |  Next  |  Last  >>