Reaction Details
TargetEphrin type-A receptor 6
LigandBDBM13534
Substrate/Competitorn/a
Meas. Tech.ChEMBL_586452 (CHEMBL1063707)
Kd>10000±n/a nM
Citation Karaman, MWHerrgard, STreiber, DKGallant, PAtteridge, CECampbell, BTChan, KWCiceri, PDavis, MIEdeen, PTFaraoni, RFloyd, MHunt, JPLockhart, DJMilanov, ZVMorrison, MJPallares, GPatel, HKPritchard, SWodicka, LMZarrinkar, PP A quantitative analysis of kinase inhibitor selectivity. Nat Biotechnol26:127-32 (2008) 
 
Ephrin type-A receptor 6
Name:Ephrin type-A receptor 6
Type:PROTEIN
Mol. Mass.:116385.76
Organism:Homo sapiens (Human)
Description:ChEMBL_774228
Residue:1036
BDBM13534
NameBDBM13534
Synonyms:CHEMBL572878 N-[4-[[4-(4-methylpiperazino)-6-[(5-methyl-1H-pyrazol-3-yl)amino]pyrimidin-2-yl]thio]phenyl]cyclopropanecarboxamide VX680 | cyclopropane carboxylic acid {4-[4-(4-methyl-piperazin-1-yl)-6-(5-methyl-2H-pyrazol-3-ylamino)-pyrimidin-2ylsulphanyl]-phenyl}-amide
TypeSmall organic molecule
Emp. Form.C23H28N8OS
Mol. Mass.464.586
SMILESCN1CCN(CC1)c1cc(Nc2cc(C)n[nH]2)nc(Sc2ccc(NC(=O)C3CC3)cc2)n1