BDBM313390 N-(3-(2-(3- (difluoromethyl)oxetan- 3-yl)-6-(2- hydroxyethoxy)pyridin- 4-yl)-4-methylphenyl)- 2- (trifluoromethyl)isonicotin- amide::US10167279, Example 58
SMILES: Cc1ccc(NC(=O)c2ccnc(c2)C(F)(F)F)cc1-c1cc(OCCO)nc(c1)C1(COC1)C(F)F
InChI Key: InChIKey=DVXAFYDKYYTGPH-UHFFFAOYSA-N
Data: 1 IC50
Activity Spreadsheet -- Enzyme Inhibition Constant Data from BindingDB
Found 1 hit for monomerid = 313390
Trg + Lig
Ki
nM
ΔG°
kcal/mole
IC50
nM
Kd
nM
EC50/IC50
nM
koff
s-1
kon
M-1s-1
pHTemp
°C
RAF proto-oncogene serine/threonine-protein kinase
(Homo sapiens (Human))
BDBM313390
(N-(3-(2-(3- (difluoromethyl)oxetan- 3-yl)-6-(2- hy...)
Show SMILES Cc1ccc(NC(=O)c2ccnc(c2)C(F)(F)F)cc1-c1cc(OCCO)nc(c1)C1(COC1)C(F)F
Show InChI InChI=1S/C25H22F5N3O4/c1-14-2-3-17(32-22(35)15-4-5-31-20(8-15)25(28,29)30)11-18(14)16-9-19(24(23(26)27)12-36-13-24)33-21(10-16)37-7-6-34/h2-5,8-11,23,34H,6-7,12-13H2,1H3,(H,32,35)
NCI pathway
Reactome pathway
US Patent
n/an/a 15.5n/an/an/an/an/an/a
Novartis AG
US Patent
Assay Description
Assay Materials: Assay buffer is 50 mM Tris, pH 7.5, 15 mM MgCl2, 0.01% Bovine Serum Albumin (BSA) and 1 mM dithiothreitol (DTT); Stop buffer is 60 m...
US Patent US10167279 (2019)
BindingDB Entry DOI: 10.7270/Q2W0981V