BDBM313685 (S)-N-(3-(6-((2- hydroxypropyl)amino)- 5-(tetrahydro-2H-pyran- 4-yl)pyridazin-3-yl)-4- methylphenyl)-2- (trifluoromethyl) isonicotinamide::US10167279, Example 311
SMILES: C[C@H](O)CNc1nnc(cc1C1CCOCC1)-c1cc(NC(=O)c2ccnc(c2)C(F)(F)F)ccc1C
InChI Key: InChIKey=RORGLLVNFZEJNG-INIZCTEOSA-N
Data: 1 IC50
Activity Spreadsheet -- Enzyme Inhibition Constant Data from BindingDB
Found 1 hit for monomerid = 313685
Trg + Lig
Ki
nM
ΔG°
kcal/mole
IC50
nM
Kd
nM
EC50/IC50
nM
koff
s-1
kon
M-1s-1
pHTemp
°C
RAF proto-oncogene serine/threonine-protein kinase
(Homo sapiens (Human))
BDBM313685
((S)-N-(3-(6-((2- hydroxypropyl)amino)- 5-(tetrahyd...)
Show SMILES C[C@H](O)CNc1nnc(cc1C1CCOCC1)-c1cc(NC(=O)c2ccnc(c2)C(F)(F)F)ccc1C |r|
Show InChI InChI=1S/C26H28F3N5O3/c1-15-3-4-19(32-25(36)18-5-8-30-23(11-18)26(27,28)29)12-20(15)22-13-21(17-6-9-37-10-7-17)24(34-33-22)31-14-16(2)35/h3-5,8,11-13,16-17,35H,6-7,9-10,14H2,1-2H3,(H,31,34)(H,32,36)/t16-/m0/s1
NCI pathway
Reactome pathway
US Patent
n/an/a 50n/an/an/an/an/an/a
Novartis AG
US Patent
Assay Description
Assay Materials: Assay buffer is 50 mM Tris, pH 7.5, 15 mM MgCl2, 0.01% Bovine Serum Albumin (BSA) and 1 mM dithiothreitol (DTT); Stop buffer is 60 m...
US Patent US10167279 (2019)
BindingDB Entry DOI: 10.7270/Q2W0981V