BDBM31790 thieno[2,3-d]pyrimidine deriv., 2m
SMILES: CCc1sc2nc(N)[nH]c(=O)c2c1Sc1ccccc1Cl
InChI Key: InChIKey=BEYHYOYOCMIKPU-UHFFFAOYSA-N
Data: 6 IC50
Activity Spreadsheet -- Enzyme Inhibition Constant Data from BindingDB
Found 6 hits for monomerid = 31790
Trg + Lig
Ki
nM
ΔG°
kcal/mole
IC50
nM
Kd
nM
EC50/IC50
nM
koff
s-1
kon
M-1s-1
pHTemp
°C
Thymidylate synthase
(Homo sapiens (Human))
BDBM31790
(thieno[2,3-d]pyrimidine deriv., 2m)
Show SMILES CCc1sc2nc(N)[nH]c(=O)c2c1Sc1ccccc1Cl
Show InChI InChI=1S/C14H12ClN3OS2/c1-2-8-11(20-9-6-4-3-5-7(9)15)10-12(19)17-14(16)18-13(10)21-8/h3-6H,2H2,1H3,(H3,16,17,18,19)
NCI pathway
Reactome pathway
n/an/a 1.10E+3n/an/an/an/a7.430
Duquesne University
Assay Description
TS was assayed spectrophotometrically in the reaction buffer solution containing (6R, 6S)-5, 10-CH2H4folate. The reaction was initiated by the additi...
J Med Chem 52: 4892-902 (2009)
Article DOI: 10.1021/jm900490a
BindingDB Entry DOI: 10.7270/Q2CR5RPK
Thymidylate Synthase (TS)
(Escherichia coli)
BDBM31790
(thieno[2,3-d]pyrimidine deriv., 2m)
Show SMILES CCc1sc2nc(N)[nH]c(=O)c2c1Sc1ccccc1Cl
Show InChI InChI=1S/C14H12ClN3OS2/c1-2-8-11(20-9-6-4-3-5-7(9)15)10-12(19)17-14(16)18-13(10)21-8/h3-6H,2H2,1H3,(H3,16,17,18,19)
n/an/a 2.00E+3n/an/an/an/an/an/a
Duquesne University
Assay Description
TS was assayed spectrophotometrically in the reaction buffer solution containing (6R, 6S)-5, 10-CH2H4folate. The reaction was initiated by the additi...
J Med Chem 52: 4892-902 (2009)
Article DOI: 10.1021/jm900490a
BindingDB Entry DOI: 10.7270/Q2CR5RPK
Dihydrofolate reductase (DHFR)
(Toxoplasma gondii)
BDBM31790
(thieno[2,3-d]pyrimidine deriv., 2m)
Show SMILES CCc1sc2nc(N)[nH]c(=O)c2c1Sc1ccccc1Cl
Show InChI InChI=1S/C14H12ClN3OS2/c1-2-8-11(20-9-6-4-3-5-7(9)15)10-12(19)17-14(16)18-13(10)21-8/h3-6H,2H2,1H3,(H3,16,17,18,19)
n/an/a 27n/an/an/an/an/an/a
Duquesne University
Assay Description
DHFRs were assayed spectrophotometrically in the reaction buffer solution containing dihydrofolate. The reaction was initiated with an amount of enzy...
J Med Chem 52: 4892-902 (2009)
Article DOI: 10.1021/jm900490a
BindingDB Entry DOI: 10.7270/Q2CR5RPK
Dihydrofolate reductase
(Homo sapiens (Human))
BDBM31790
(thieno[2,3-d]pyrimidine deriv., 2m)
Show SMILES CCc1sc2nc(N)[nH]c(=O)c2c1Sc1ccccc1Cl
Show InChI InChI=1S/C14H12ClN3OS2/c1-2-8-11(20-9-6-4-3-5-7(9)15)10-12(19)17-14(16)18-13(10)21-8/h3-6H,2H2,1H3,(H3,16,17,18,19)
NCI pathway
Reactome pathway
n/an/a 600n/an/an/an/an/an/a
Duquesne University
Assay Description
DHFRs were assayed spectrophotometrically in the reaction buffer solution containing dihydrofolate. The reaction was initiated with an amount of enzy...
J Med Chem 52: 4892-902 (2009)
Article DOI: 10.1021/jm900490a
BindingDB Entry DOI: 10.7270/Q2CR5RPK
Dihydrofolate Reductase (DHFR)
(Escherichia coli)
BDBM31790
(thieno[2,3-d]pyrimidine deriv., 2m)
Show SMILES CCc1sc2nc(N)[nH]c(=O)c2c1Sc1ccccc1Cl
Show InChI InChI=1S/C14H12ClN3OS2/c1-2-8-11(20-9-6-4-3-5-7(9)15)10-12(19)17-14(16)18-13(10)21-8/h3-6H,2H2,1H3,(H3,16,17,18,19)
n/an/a>3.30E+4n/an/an/an/an/an/a
Duquesne University
Assay Description
DHFRs were assayed spectrophotometrically in the reaction buffer solution containing dihydrofolate. The reaction was initiated with an amount of enzy...
J Med Chem 52: 4892-902 (2009)
Article DOI: 10.1021/jm900490a
BindingDB Entry DOI: 10.7270/Q2CR5RPK
Dihydrofolate reductase (DHFR)
(Toxoplasma gondii)
BDBM31790
(thieno[2,3-d]pyrimidine deriv., 2m)
Show SMILES CCc1sc2nc(N)[nH]c(=O)c2c1Sc1ccccc1Cl
Show InChI InChI=1S/C14H12ClN3OS2/c1-2-8-11(20-9-6-4-3-5-7(9)15)10-12(19)17-14(16)18-13(10)21-8/h3-6H,2H2,1H3,(H3,16,17,18,19)
n/an/a 2.50E+3n/an/an/an/an/an/a
Duquesne University
Assay Description
TS was assayed spectrophotometrically in the reaction buffer solution containing (6R, 6S)-5, 10-CH2H4folate. The reaction was initiated by the additi...
J Med Chem 52: 4892-902 (2009)
Article DOI: 10.1021/jm900490a
BindingDB Entry DOI: 10.7270/Q2CR5RPK