BDBM31801 2-aminobenzimidazole deriv., 12
SMILES: Nc1nc2cccc(-c3ccccc3)c2n1Cc1ccc(Cl)c(Cl)c1
InChI Key: InChIKey=JFVMZMBFRZPOFF-UHFFFAOYSA-N
Data: 1 KI
PDB links: 1 PDB ID matches this monomer.
Activity Spreadsheet -- Enzyme Inhibition Constant Data from BindingDB
Found 1 hit for monomerid = 31801
Trg + Lig
Ki
nM
ΔG°
kcal/mole
IC50
nM
Kd
nM
EC50/IC50
nM
koff
s-1
kon
M-1s-1
pHTemp
°C
Pteridine Reductase 1 (PTR1)
(Trypanosoma brucei brucei)
BDBM31801
(2-aminobenzimidazole deriv., 12)
Show SMILES Nc1nc2cccc(-c3ccccc3)c2n1Cc1ccc(Cl)c(Cl)c1
Show InChI InChI=1S/C20H15Cl2N3/c21-16-10-9-13(11-17(16)22)12-25-19-15(14-5-2-1-3-6-14)7-4-8-18(19)24-20(25)23/h1-11H,12H2,(H2,23,24)
7 -11.0n/an/an/an/an/a6.023
University of Dundee
Assay Description
TbPTR1 activity was measured in 96-well microtiter plates via reduction of cytochrome c (cytc) as a result of the enzymatic production of tetrahydrob...
J Med Chem 52: 4454-65 (2009)
Article DOI: 10.1021/jm900414x
BindingDB Entry DOI: 10.7270/Q28050X3
3D
3D Structure (crystal)