BDBM345318 US10202350, Example 64::US10214492, Example 64
SMILES: COc1ccc(s1)-c1cc(COC(C)(C)C(O)=O)nn1Cc1ccccc1Cl
InChI Key: InChIKey=COUMSONLMUNMPZ-UHFFFAOYSA-N
Data: 4 IC50
Activity Spreadsheet -- Enzyme Inhibition Constant Data from BindingDB
Found 4 hits for monomerid = 345318
Trg + Lig
Ki
nM
ΔG°
kcal/mole
IC50
nM
Kd
nM
EC50/IC50
nM
koff
s-1
kon
M-1s-1
pHTemp
°C
Monocarboxylate transporter 4
(Homo sapiens (Human))
BDBM345318
(US10202350, Example 64 | US10214492, Example 64)
Show SMILES COc1ccc(s1)-c1cc(COC(C)(C)C(O)=O)nn1Cc1ccccc1Cl
Show InChI InChI=1S/C20H21ClN2O4S/c1-20(2,19(24)25)27-12-14-10-16(17-8-9-18(26-3)28-17)23(22-14)11-13-6-4-5-7-15(13)21/h4-10H,11-12H2,1-3H3,(H,24,25)
Reactome pathway
US Patent
n/an/a 8.30n/an/an/an/an/an/a
Vettore, LLC
US Patent
Assay Description
MDA-MB-231 breast cancer cells may be used to measure MCT4 activity in cells with high native levels of MCT4 and low levels of MCT1 and are known to ...
US Patent US10202350 (2019)
BindingDB Entry DOI: 10.7270/Q20K2BPB
Monocarboxylate transporter 1
(Homo sapiens (Human))
BDBM345318
(US10202350, Example 64 | US10214492, Example 64)
Show SMILES COc1ccc(s1)-c1cc(COC(C)(C)C(O)=O)nn1Cc1ccccc1Cl
Show InChI InChI=1S/C20H21ClN2O4S/c1-20(2,19(24)25)27-12-14-10-16(17-8-9-18(26-3)28-17)23(22-14)11-13-6-4-5-7-15(13)21/h4-10H,11-12H2,1-3H3,(H,24,25)
Reactome pathway
US Patent
n/an/a 4.50E+4n/an/an/an/an/an/a
Vettore, LLC
US Patent
Assay Description
MCT1 activity may be measured using BT-20 breast cancer cells that express high native levels of MCT1, but do not express MCT4 and are known to those...
US Patent US10214492 (2019)
BindingDB Entry DOI: 10.7270/Q2Q81GC0
Monocarboxylate transporter 4
(Homo sapiens (Human))
BDBM345318
(US10202350, Example 64 | US10214492, Example 64)
Show SMILES COc1ccc(s1)-c1cc(COC(C)(C)C(O)=O)nn1Cc1ccccc1Cl
Show InChI InChI=1S/C20H21ClN2O4S/c1-20(2,19(24)25)27-12-14-10-16(17-8-9-18(26-3)28-17)23(22-14)11-13-6-4-5-7-15(13)21/h4-10H,11-12H2,1-3H3,(H,24,25)
Reactome pathway
US Patent
n/an/a 8.30n/an/an/an/an/an/a
Vettore, LLC
US Patent
Assay Description
MDA-MB-231 breast cancer cells may be used to measure MCT4 activity in cells with high native levels of MCT4 and low levels of MCT1 and are known to ...
US Patent US10214492 (2019)
BindingDB Entry DOI: 10.7270/Q2Q81GC0
Malignant T-cell-amplified sequence 1
(Homo sapiens (human))
BDBM345318
(US10202350, Example 64 | US10214492, Example 64)
Show SMILES COc1ccc(s1)-c1cc(COC(C)(C)C(O)=O)nn1Cc1ccccc1Cl
Show InChI InChI=1S/C20H21ClN2O4S/c1-20(2,19(24)25)27-12-14-10-16(17-8-9-18(26-3)28-17)23(22-14)11-13-6-4-5-7-15(13)21/h4-10H,11-12H2,1-3H3,(H,24,25)
US Patent
n/an/a 4.50E+4n/an/an/an/an/an/a
Vettore, LLC
US Patent
Assay Description
MCT1 activity may be measured using BT-20 breast cancer cells that express high native levels of MCT1, but do not express MCT4 and are known to those...
US Patent US10202350 (2019)
BindingDB Entry DOI: 10.7270/Q20K2BPB