BDBM345321 2-([1-(o-Chlorophenyl)methyl]-5-(m-methoxyphenyl)-1H-pyrazol-3-yl)methoxy)-2-ethylbutyric Acid::US10202350, Example 67::US10214492, Example 67
SMILES: CCC(CC)(OCc1cc(-c2cccc(OC)c2)n(Cc2ccccc2Cl)n1)C(O)=O
InChI Key: InChIKey=ZTNRFRRMVBDPHU-UHFFFAOYSA-N
Data: 4 IC50
Activity Spreadsheet -- Enzyme Inhibition Constant Data from BindingDB
Found 4 hits for monomerid = 345321
Trg + Lig
Ki
nM
ΔG°
kcal/mole
IC50
nM
Kd
nM
EC50/IC50
nM
koff
s-1
kon
M-1s-1
pHTemp
°C
Monocarboxylate transporter 4
(Homo sapiens (Human))
BDBM345321
(2-([1-(o-Chlorophenyl)methyl]-5-(m-methoxyphenyl)-...)
Show SMILES CCC(CC)(OCc1cc(-c2cccc(OC)c2)n(Cc2ccccc2Cl)n1)C(O)=O
Show InChI InChI=1S/C24H27ClN2O4/c1-4-24(5-2,23(28)29)31-16-19-14-22(17-10-8-11-20(13-17)30-3)27(26-19)15-18-9-6-7-12-21(18)25/h6-14H,4-5,15-16H2,1-3H3,(H,28,29)
Reactome pathway
US Patent
n/an/a 11n/an/an/an/an/an/a
Vettore, LLC
US Patent
Assay Description
MDA-MB-231 breast cancer cells may be used to measure MCT4 activity in cells with high native levels of MCT4 and low levels of MCT1 and are known to ...
US Patent US10202350 (2019)
BindingDB Entry DOI: 10.7270/Q20K2BPB
Monocarboxylate transporter 1
(Homo sapiens (Human))
BDBM345321
(2-([1-(o-Chlorophenyl)methyl]-5-(m-methoxyphenyl)-...)
Show SMILES CCC(CC)(OCc1cc(-c2cccc(OC)c2)n(Cc2ccccc2Cl)n1)C(O)=O
Show InChI InChI=1S/C24H27ClN2O4/c1-4-24(5-2,23(28)29)31-16-19-14-22(17-10-8-11-20(13-17)30-3)27(26-19)15-18-9-6-7-12-21(18)25/h6-14H,4-5,15-16H2,1-3H3,(H,28,29)
Reactome pathway
US Patent
n/an/a 1.70E+4n/an/an/an/an/an/a
Vettore, LLC
US Patent
Assay Description
MCT1 activity may be measured using BT-20 breast cancer cells that express high native levels of MCT1, but do not express MCT4 and are known to those...
US Patent US10214492 (2019)
BindingDB Entry DOI: 10.7270/Q2Q81GC0
Monocarboxylate transporter 4
(Homo sapiens (Human))
BDBM345321
(2-([1-(o-Chlorophenyl)methyl]-5-(m-methoxyphenyl)-...)
Show SMILES CCC(CC)(OCc1cc(-c2cccc(OC)c2)n(Cc2ccccc2Cl)n1)C(O)=O
Show InChI InChI=1S/C24H27ClN2O4/c1-4-24(5-2,23(28)29)31-16-19-14-22(17-10-8-11-20(13-17)30-3)27(26-19)15-18-9-6-7-12-21(18)25/h6-14H,4-5,15-16H2,1-3H3,(H,28,29)
Reactome pathway
US Patent
n/an/a 11n/an/an/an/an/an/a
Vettore, LLC
US Patent
Assay Description
MDA-MB-231 breast cancer cells may be used to measure MCT4 activity in cells with high native levels of MCT4 and low levels of MCT1 and are known to ...
US Patent US10214492 (2019)
BindingDB Entry DOI: 10.7270/Q2Q81GC0
Malignant T-cell-amplified sequence 1
(Homo sapiens (human))
BDBM345321
(2-([1-(o-Chlorophenyl)methyl]-5-(m-methoxyphenyl)-...)
Show SMILES CCC(CC)(OCc1cc(-c2cccc(OC)c2)n(Cc2ccccc2Cl)n1)C(O)=O
Show InChI InChI=1S/C24H27ClN2O4/c1-4-24(5-2,23(28)29)31-16-19-14-22(17-10-8-11-20(13-17)30-3)27(26-19)15-18-9-6-7-12-21(18)25/h6-14H,4-5,15-16H2,1-3H3,(H,28,29)
US Patent
n/an/a 1.70E+4n/an/an/an/an/an/a
Vettore, LLC
US Patent
Assay Description
MCT1 activity may be measured using BT-20 breast cancer cells that express high native levels of MCT1, but do not express MCT4 and are known to those...
US Patent US10202350 (2019)
BindingDB Entry DOI: 10.7270/Q20K2BPB