BDBM346324 US10202377, Compound 298
SMILES: CC(C)Nc1cncc(c1)-c1cc2c(n[nH]c2cn1)-c1nc2c(cccc2[nH]1)-c1ccoc1
InChI Key: InChIKey=FCILEVZAEBRWRE-UHFFFAOYSA-N
Data: 1 IC50  1 EC50
Activity Spreadsheet -- Enzyme Inhibition Constant Data from BindingDB
Found 2 hits for monomerid = 346324
Trg + Lig
Ki
nM
ΔG°
kcal/mole
IC50
nM
Kd
nM
EC50/IC50
nM
koff
s-1
kon
M-1s-1
pHTemp
°C
TGF-beta receptor type-1
(Homo sapiens (Human))
BDBM346324
(US10202377, Compound 298)
Show SMILES CC(C)Nc1cncc(c1)-c1cc2c(n[nH]c2cn1)-c1nc2c(cccc2[nH]1)-c1ccoc1
Show InChI InChI=1S/C25H21N7O/c1-14(2)28-17-8-16(10-26-11-17)21-9-19-22(12-27-21)31-32-24(19)25-29-20-5-3-4-18(23(20)30-25)15-6-7-33-13-15/h3-14,28H,1-2H3,(H,29,30)(H,31,32)
US Patent
n/an/an/an/a 9n/an/an/an/a
Samumed, LLC
US Patent
Assay Description
Compound Screening: Each compound was dissolved in DMSO as a 10 mM stock and used to prepare compound source plates. Serial dilution (1:2, 11-point d...
US Patent US10202377 (2019)
BindingDB Entry DOI: 10.7270/Q2639RV7
Proto-oncogene Wnt-1
(Homo sapiens (human))
BDBM346324
(US10202377, Compound 298)
Show SMILES CC(C)Nc1cncc(c1)-c1cc2c(n[nH]c2cn1)-c1nc2c(cccc2[nH]1)-c1ccoc1
Show InChI InChI=1S/C25H21N7O/c1-14(2)28-17-8-16(10-26-11-17)21-9-19-22(12-27-21)31-32-24(19)25-29-20-5-3-4-18(23(20)30-25)15-6-7-33-13-15/h3-14,28H,1-2H3,(H,29,30)(H,31,32)
US Patent
n/an/a 12.9n/an/an/an/an/an/a
Samumed, LLC
US Patent
Assay Description
The screening assay for Wnt activity is described as follows. Reporter cell lines can be generated by stably transducing cancer cell lines (e.g., col...
US Patent US10202377 (2019)
BindingDB Entry DOI: 10.7270/Q2639RV7