BDBM346333 US10202377, Compound 325
SMILES: CN(C)Cc1cncc(c1)-c1cc2c(n[nH]c2cn1)-c1nc2c(cccc2[nH]1)-c1cccs1
InChI Key: InChIKey=ULMWDFZEKUZAJS-UHFFFAOYSA-N
Data: 1 IC50  1 EC50
Activity Spreadsheet -- Enzyme Inhibition Constant Data from BindingDB
Found 2 hits for monomerid = 346333
Trg + Lig
Ki
nM
ΔG°
kcal/mole
IC50
nM
Kd
nM
EC50/IC50
nM
koff
s-1
kon
M-1s-1
pHTemp
°C
TGF-beta receptor type-1
(Homo sapiens (Human))
BDBM346333
(US10202377, Compound 325)
Show SMILES CN(C)Cc1cncc(c1)-c1cc2c(n[nH]c2cn1)-c1nc2c(cccc2[nH]1)-c1cccs1
Show InChI InChI=1S/C25H21N7S/c1-32(2)14-15-9-16(12-26-11-15)20-10-18-21(13-27-20)30-31-24(18)25-28-19-6-3-5-17(23(19)29-25)22-7-4-8-33-22/h3-13H,14H2,1-2H3,(H,28,29)(H,30,31)
US Patent
n/an/an/an/a 9n/an/an/an/a
Samumed, LLC
US Patent
Assay Description
Compound Screening: Each compound was dissolved in DMSO as a 10 mM stock and used to prepare compound source plates. Serial dilution (1:2, 11-point d...
US Patent US10202377 (2019)
BindingDB Entry DOI: 10.7270/Q2639RV7
Proto-oncogene Wnt-1
(Homo sapiens (human))
BDBM346333
(US10202377, Compound 325)
Show SMILES CN(C)Cc1cncc(c1)-c1cc2c(n[nH]c2cn1)-c1nc2c(cccc2[nH]1)-c1cccs1
Show InChI InChI=1S/C25H21N7S/c1-32(2)14-15-9-16(12-26-11-15)20-10-18-21(13-27-20)30-31-24(18)25-28-19-6-3-5-17(23(19)29-25)22-7-4-8-33-22/h3-13H,14H2,1-2H3,(H,28,29)(H,30,31)
US Patent
n/an/a 26.7n/an/an/an/an/an/a
Samumed, LLC
US Patent
Assay Description
The screening assay for Wnt activity is described as follows. Reporter cell lines can be generated by stably transducing cancer cell lines (e.g., col...
US Patent US10202377 (2019)
BindingDB Entry DOI: 10.7270/Q2639RV7