BDBM355857 4-ethoxy-N-(3-fluoro-4-((5-(3-(1-hydroxyethyl)phenyl)pyrrolo[1,2-b]pyridazin-4-yl)oxy)phenyl)-1-(4-fluorophenyl)-2-oxo-1,2-dihydropyridin-3-carboxamide::US9815840, Example 46
SMILES: CCOc1ccn(-c2ccc(F)cc2)c(=O)c1C(=O)Nc1ccc(Oc2ccnn3ccc(-c4cccc(c4)C(C)O)c23)c(F)c1
InChI Key: InChIKey=HZGYKONSAWPITL-UHFFFAOYSA-N
Data: 1 IC50
Activity Spreadsheet -- Enzyme Inhibition Constant Data from BindingDB
Found 1 hit for monomerid = 355857
Trg + Lig
Ki
nM
ΔG°
kcal/mole
IC50
nM
Kd
nM
EC50/IC50
nM
koff
s-1
kon
M-1s-1
pHTemp
°C
Hepatocyte growth factor receptor
(Homo sapiens (Human))
BDBM355857
(4-ethoxy-N-(3-fluoro-4-((5-(3-(1-hydroxyethyl)phen...)
Show SMILES CCOc1ccn(-c2ccc(F)cc2)c(=O)c1C(=O)Nc1ccc(Oc2ccnn3ccc(-c4cccc(c4)C(C)O)c23)c(F)c1
Show InChI InChI=1S/C35H28F2N4O5/c1-3-45-30-15-17-40(26-10-7-24(36)8-11-26)35(44)32(30)34(43)39-25-9-12-29(28(37)20-25)46-31-13-16-38-41-18-14-27(33(31)41)23-6-4-5-22(19-23)21(2)42/h4-21,42H,3H2,1-2H3,(H,39,43)
US Patent
n/an/a<40n/an/an/an/an/an/a
The Asan Foundation
US Patent
Assay Description
The inhibitory effect of the compounds of the present invention on the activity of c-Met was confirmed as follows.Specifically, 250 μM G4Y1 pept...
US Patent US9815840 (2017)
BindingDB Entry DOI: 10.7270/Q2862JQZ