null
SMILES: CN(C)Cc1cc(F)cc(c1)-c1ccn2nccc(Oc3ccc(NC(=O)C4(CC4)C(=O)Nc4ccc(F)cc4)cc3F)c12
InChI Key: InChIKey=BUUWDMLKCDTDLC-UHFFFAOYSA-N
Activity Spreadsheet -- Enzyme Inhibition Constant Data from BindingDB
Found 1 hit for monomerid = 355869
Trg + Lig
Ki
nM
ΔG°
kcal/mole
IC50
nM
Kd
nM
EC50/IC50
nM
koff
s-1
kon
M-1s-1
pHTemp
°C
Hepatocyte growth factor receptor
(Homo sapiens (Human))
BDBM355869
(N-(4-((5-(3-((dimethylamino)methyl)-5-fluorophenyl...)
Show SMILES CN(C)Cc1cc(F)cc(c1)-c1ccn2nccc(Oc3ccc(NC(=O)C4(CC4)C(=O)Nc4ccc(F)cc4)cc3F)c12
Show InChI InChI=1S/C33H28F3N5O3/c1-40(2)19-20-15-21(17-23(35)16-20)26-10-14-41-30(26)29(9-13-37-41)44-28-8-7-25(18-27(28)36)39-32(43)33(11-12-33)31(42)38-24-5-3-22(34)4-6-24/h3-10,13-18H,11-12,19H2,1-2H3,(H,38,42)(H,39,43)
US Patent
n/an/a<40n/an/an/an/an/an/a
The Asan Foundation
US Patent
Assay Description
The inhibitory effect of the compounds of the present invention on the activity of c-Met was confirmed as follows.Specifically, 250 μM G4Y1 pept...
US Patent US9815840 (2017)
BindingDB Entry DOI: 10.7270/Q2862JQZ