BDBM36165 cholate (CA)
SMILES: CC(CCC([O-])=O)[C@H]1CCC2C3[C@@H](O)CC4C[C@H](O)CC[C@]4(C)C3C[C@H](O)[C@]12C
InChI Key: InChIKey=BHQCQFFYRZLCQQ-RAXHICHDSA-M
Data: 7 ITC
Activity Spreadsheet -- ITC Data from BindingDB
Found 7 hits for monomerid = 36165
Cell (A)Syringe (B)Cell
Syringe
Cell + Syr
ΔG°
kcal/mole
-TΔS°
kcal/mole
ΔH°
kcal/mole
log KpHTemp
°C
BDBM11
JPEG
BDBM36165
JPEG
n/a0.577-5.493.617.2025
Nankai University
J Org Chem 70: 8703-11 (2005)
BDBM36166
JPEG
BDBM36165
JPEG
n/a1.03-5.543.317.2025
Nankai University
J Org Chem 70: 8703-11 (2005)
BDBM36167
JPEG
BDBM36165
JPEG
n/a3.46-9.053.827.2025
Nankai University
J Org Chem 70: 8703-11 (2005)
BDBM11
JPEG
BDBM36165
JPEG
-4.920.570-5.493.617.2025
Nankai University
J Phys Chem B 107: 14130 (2003)
BDBM36127
JPEG
BDBM36165
JPEG
-5.520.584-6.104.057.2025
Nankai University
J Phys Chem B 107: 14130 (2003)
BDBM36171
JPEG
BDBM36165
JPEG
-5.020.926-5.953.687.2025
Nankai University
J Phys Chem B 107: 14130 (2003)
BDBM36172
JPEG
BDBM36165
JPEG
-5.760.954-6.714.237.2025
Nankai University
J Phys Chem B 107: 14130 (2003)