BDBM36169 glycocholate (GCA)
SMILES: CC(CCC(=O)NCC([O-])=O)[C@H]1CCC2C3[C@@H](O)CC4C[C@H](O)CC[C@]4(C)C3C[C@H](O)[C@]12C
InChI Key: InChIKey=RFDAIACWWDREDC-XOLZFWJXSA-M
Data: 7 ITC
Activity Spreadsheet -- ITC Data from BindingDB
Found 7 hits for monomerid = 36169
Cell (A)Syringe (B)Cell
Syringe
Cell + Syr
ΔG°
kcal/mole
-TΔS°
kcal/mole
ΔH°
kcal/mole
log KpHTemp
°C
BDBM11
JPEG
BDBM36169
JPEG
n/a0.883-5.493.377.2025
Nankai University
J Org Chem 70: 8703-11 (2005)
BDBM36166
JPEG
BDBM36169
JPEG
n/a1.42-5.593.057.2025
Nankai University
J Org Chem 70: 8703-11 (2005)
BDBM36167
JPEG
BDBM36169
JPEG
n/a1.53-5.953.257.2025
Nankai University
J Org Chem 70: 8703-11 (2005)
BDBM11
JPEG
BDBM36169
JPEG
-4.610.883-5.493.387.2025
Nankai University
J Phys Chem B 107: 14130 (2003)
BDBM36127
JPEG
BDBM36169
JPEG
-4.521.67-6.193.327.2025
Nankai University
J Phys Chem B 107: 14130 (2003)
BDBM36171
JPEG
BDBM36169
JPEG
-4.560.157-4.723.357.2025
Nankai University
J Phys Chem B 107: 14130 (2003)
BDBM36172
JPEG
BDBM36169
JPEG
-4.901.01-5.913.597.2025
Nankai University
J Phys Chem B 107: 14130 (2003)