BDBM36278 1,9-nonanediol
SMILES: OCCCCCCCCCO
InChI Key: InChIKey=ALVZNPYWJMLXKV-UHFFFAOYSA-N
Data: 1 ITC
Activity Spreadsheet -- ITC Data from BindingDB
Found 1 hit for monomerid = 36278
Cell (A)Syringe (B)Cell
Syringe
Cell + Syr
ΔG°
kcal/mole
-TΔS°
kcal/mole
ΔH°
kcal/mole
log KpHTemp
°C
BDBM36277
JPEG
BDBM36278
JPEG
-6.884.63-11.55.05n/a25
Institute of Organic Chemistry and Biochemistry AS CR
J Org Chem 74: 1082-92 (2009)