BDBM36277 alpha-cyclodextrin doubly bridged dimer, 6
SMILES: OC[C@H]1O[C@@H]2O[C@@H]3[C@@H](CO)O[C@H](O[C@@H]4[C@H]5CSSC[C@H]6O[C@@H]7O[C@@H]8[C@@H](CO)O[C@H](O[C@@H]9[C@@H](CO)O[C@H](O[C@@H]%10[C@@H](CSSC[C@H]%11O[C@H](O[C@H]1[C@H](O)[C@H]2O)[C@H](O)[C@@H](O)[C@@H]%11O[C@H]1O[C@H](CO)[C@@H](O[C@H]2O[C@H](CO)[C@@H](O[C@@H](O5)[C@H](O)[C@H]4O)[C@H](O)[C@H]2O)[C@H](O)[C@H]1O)O[C@H](O[C@@H]1[C@@H](CO)O[C@H](O[C@@H]2[C@@H](CO)O[C@H](O[C@H]6[C@H](O)[C@H]7O)[C@H](O)[C@H]2O)[C@H](O)[C@H]1O)[C@H](O)[C@H]%10O)[C@H](O)[C@H]9O)[C@H](O)[C@H]8O)[C@H](O)[C@H]3O
InChI Key: InChIKey=DTPVZMSJLDWAMF-PKOTZRQHSA-N
Data: 8 ITC
Activity Spreadsheet -- ITC Data from BindingDB
Found 8 hits for monomerid = 36277
Cell (A)Syringe (B)Cell
Syringe
Cell + Syr
ΔG°
kcal/mole
-TΔS°
kcal/mole
ΔH°
kcal/mole
log KpHTemp
°C
BDBM36277
JPEG
BDBM36278
JPEG
-6.884.63-11.55.05n/a25
Institute of Organic Chemistry and Biochemistry AS CR
J Org Chem 74: 1082-92 (2009)
BDBM36277
JPEG
BDBM36279
JPEG
-8.665.68-14.36.35n/a25
Institute of Organic Chemistry and Biochemistry AS CR
J Org Chem 74: 1082-92 (2009)
BDBM36277
JPEG
BDBM36274
JPEG
-10.26.25-16.47.47n/a25
Institute of Organic Chemistry and Biochemistry AS CR
J Org Chem 74: 1082-92 (2009)
BDBM36277
JPEG
BDBM50046090
JPEG
-11.96.20-18.18.69n/a25
Institute of Organic Chemistry and Biochemistry AS CR
J Org Chem 74: 1082-92 (2009)
BDBM36277
JPEG
BDBM36275
JPEG
-12.86.74-19.69.40n/a25
Institute of Organic Chemistry and Biochemistry AS CR
J Org Chem 74: 1082-92 (2009)
BDBM36277
JPEG
BDBM36276
JPEG
-13.56.77-20.39.93n/a25
Institute of Organic Chemistry and Biochemistry AS CR
J Org Chem 74: 1082-92 (2009)
BDBM36277
JPEG
BDBM22607
JPEG
-8.622.70-11.36.32n/a25
Institute of Organic Chemistry and Biochemistry AS CR
J Org Chem 74: 1082-92 (2009)
BDBM36277
JPEG
BDBM36280
JPEG
-10.04.42-14.47.33n/a25
Institute of Organic Chemistry and Biochemistry AS CR
J Org Chem 74: 1082-92 (2009)