BDBM36280 1-decanol
SMILES: CCCCCCCCCCO
InChI Key: InChIKey=MWKFXSUHUHTGQN-UHFFFAOYSA-N
Data: 1 ITC
PDB links: 3 PDB IDs match this monomer.
Activity Spreadsheet -- ITC Data from BindingDB
Found 1 hit for monomerid = 36280
Cell (A)Syringe (B)Cell
Syringe
Cell + Syr
ΔG°
kcal/mole
-TΔS°
kcal/mole
ΔH°
kcal/mole
log KpHTemp
°C
BDBM36277
JPEG
BDBM36280
JPEG
-10.04.42-14.47.33n/a25
Institute of Organic Chemistry and Biochemistry AS CR
J Org Chem 74: 1082-92 (2009)