null
SMILES: Cc1cccc(C)c1C(=O)OCC(=O)CNC(=O)C(Cc1ccccc1)NC(=O)OCc1ccccc1
InChI Key: InChIKey=AQOWGWWWJOBAEL-UHFFFAOYSA-N
Activity Spreadsheet -- Enzyme Inhibition Constant Data from BindingDB
Found 1 hit for monomerid = 36327
Trg + Lig
Ki
nM
ΔG°
kcal/mole
IC50
nM
Kd
nM
EC50/IC50
nM
koff
s-1
kon
M-1s-1
pHTemp
°C
Cathepsin B
(Rattus norvegicus)
BDBM36327
(Z-FG-AOMK 9a)
Show SMILES Cc1cccc(C)c1C(=O)OCC(=O)CNC(=O)C(Cc1ccccc1)NC(=O)OCc1ccccc1
Show InChI InChI=1S/C29H30N2O6/c1-20-10-9-11-21(2)26(20)28(34)36-19-24(32)17-30-27(33)25(16-22-12-5-3-6-13-22)31-29(35)37-18-23-14-7-4-8-15-23/h3-15,25H,16-19H2,1-2H3,(H,30,33)(H,31,35)
n/an/a 120n/an/an/an/a5.537
Stanford University
Assay Description
Protease enzyme inhibition assay targeting diverse member of the cysteine protease families:cathepsin B, Z, and H
Nat Chem Biol 1: 33-8 (2005)
Article DOI: 10.1038/nchembio707
BindingDB Entry DOI: 10.7270/Q22V2DGV